program: Gaussian 09
title: 000015867
version: EM64L-G09RevD.01
frameworkgroup: C1[X(C18H34O3)]
method: RPBEPBE
basis: SDD
operation: Freq
keyword: #pfreq=noraman
keyword: PBEPBE/SDD
title: #p freq=noraman PBEPBE/SDD
converged: YES YES NO NO
title: Mulliken charges:
elementType: O O O C C C C C C C C C C C C C C C C C C H H H H H H H H H H H H H H H H H H H H H H H H H H H H H H H H H H
charge: -0.306802 -0.421198 -0.240033 -0.084982 -0.081788 -0.459663 -0.463312 -0.369026 -0.370918 -0.395978 -0.374521 -0.390603 -0.369576 -0.360538 -0.381115 -0.347502 -0.489092 -0.359399 -0.364151 0.182449 -0.697257 0.233585 0.229929 0.218251 0.205518 0.222066 0.208220 0.196980 0.202863 0.202275 0.197484 0.198285 0.199460 0.199379 0.194100 0.187412 0.200092 0.195513 0.182221 0.221256 0.209290 0.189125 0.189394 0.176981 0.201070 0.252499 0.248849 0.189760 0.186094 0.186964 0.206018 0.210110 0.212173 0.212802 0.378992
chargesum: 0.00000
title: Mulliken charges with hydrogens summed into heavy atoms:
elementType: O O O C C C C C C C C C C C C C C C C C C
charge: -0.306802 -0.042207 -0.240033 0.148603 0.148141 -0.035893 -0.033027 0.030816 0.028840 0.001766 0.018958 -0.003098 0.008158 0.070009 -0.002596 0.030548 0.012256 0.016455 0.028830 0.182449 -0.062173
polarizability: 2.44271431e+02 -8.79557402e-01 1.95426912e+02 -1.32534558e-02 -3.52344952e-01 1.65687657e+02
1716.lowfreq: -4.3778 -0.0005 0.0003 0.0006 7.8288 11.6702 20.8002 23.5328 36.9090
frequency: 20.7079 23.4421 36.8989 43.4941 45.7150 51.3954 55.9494 63.1743 75.1543 88.6258 91.5672 98.0160 107.8569 120.5063 127.9551 135.7180 147.5151 149.4074 167.8407 203.5995 208.7476 232.4825 243.4092 266.2310 281.7461 315.8228 320.6957 348.8664 378.7192 427.4062 454.0835 460.1009 467.4627 498.3747 521.9768 546.2744 589.9656 631.4696 707.1270 721.5973 726.7897 732.1145 746.2675 756.9337 778.6241 792.3291 811.1630 840.7351 846.9615 855.9408 874.8049 887.5589 903.2760 916.4917 937.3664 950.1962 984.4400 999.7634 1012.7298 1020.6682 1023.6122 1029.8723 1044.7206 1057.1096 1066.0604 1072.2595 1078.6463 1079.6391 1086.2770 1095.6116 1100.7228 1110.1370 1116.2958 1127.9089 1129.8071 1145.5300 1174.2599 1191.8208 1207.6728 1222.1966 1225.5581 1231.6035 1241.4806 1245.4223 1246.7096 1266.1517 1270.7523 1275.1403 1282.3231 1285.8676 1288.8754 1292.8372 1293.5843 1294.1658 1308.0899 1315.7501 1318.0009 1323.1880 1332.4971 1342.9235 1344.3805 1353.0220 1355.2050 1362.7340 1365.4785 1374.6656 1390.1071 1438.2508 1441.9319 1456.7655 1459.1248 1461.8931 1464.7462 1465.9666 1467.4020 1467.9561 1472.4254 1472.9125 1475.9004 1476.9150 1478.7916 1482.3104 1485.5385 1491.9702 1665.2637 2945.3717 2947.9508 2949.7423 2953.1114 2955.9760 2956.9704 2959.7441 2963.3253 2966.8477 2969.4444 2972.2925 2982.6508 2983.1090 2983.9647 2985.8381 2988.4454 2995.1928 2997.2902 2998.6644 3002.2397 3012.0230 3025.3347 3026.8269 3032.6417 3033.9185 3039.6475 3043.9270 3045.5464 3061.4486 3068.7728 3069.3700 3072.0372 3082.1262 3509.1249
redmass: 4.5072 4.9237 8.5280 3.7131 5.2324 2.9676 2.6815 2.4935 2.5330 2.3373 1.9105 2.9248 2.5830 2.6666 2.6686 2.4597 2.2196 2.2574 2.5714 2.4906 3.6352 1.1439 2.6954 3.4270 3.3156 2.9659 2.1801 3.2983 4.0818 2.7589 4.1959 2.8480 2.9752 1.7669 3.3227 2.5526 3.8921 1.4257 1.9101 1.1137 1.1693 1.1859 1.3976 1.2587 1.5735 1.9207 1.3588 2.3789 3.0062 2.1995 1.5860 1.8741 2.1822 1.4692 1.8357 1.8311 1.5579 2.2365 2.8529 1.6783 1.9577 1.8370 2.1816 1.7029 2.6805 2.3857 1.7283 2.1416 2.0922 2.0303 1.9667 2.0022 2.2387 2.4095 1.8371 1.4697 1.5064 1.6117 1.3667 1.3740 1.3494 1.3603 1.3565 1.3460 1.3300 1.2999 1.4136 1.2560 1.0474 1.1703 1.2049 1.1434 1.1168 1.0898 1.2070 1.2758 1.2281 1.4605 1.3639 1.4143 1.4824 1.6585 1.5748 1.5185 1.4957 1.8373 1.2164 1.0892 2.6834 1.0698 1.0777 1.0859 1.0809 1.0905 1.0922 1.0907 1.0920 1.0952 1.0870 1.0484 1.0581 1.0992 1.0920 1.0942 8.1849 1.0600 1.0588 1.0588 1.0592 1.0594 1.0599 1.0615 1.0597 1.0604 1.0598 1.0358 1.0667 1.0655 1.0896 1.0617 1.0968 1.0596 1.1002 1.0962 1.0971 1.1035 1.0991 1.1040 1.1011 1.0998 1.1042 1.0998 1.1012 1.1030 1.0998 1.0999 1.0934 1.0894 1.0639
irintensity: 0.1763 0.1247 1.5996 0.4768 1.0519 0.2445 0.1447 0.2309 0.5690 0.9586 0.0462 0.6770 0.5185 1.1104 1.4016 0.1430 0.0463 0.0429 0.6149 0.0499 0.0681 0.0059 0.2632 0.7991 2.1175 2.4380 3.1766 2.3102 5.4523 3.3199 8.9920 1.0738 6.0037 49.2772 12.6274 2.7185 20.9308 173.8432 3.9064 9.8139 13.4596 4.7525 11.6959 6.9909 9.1756 18.6290 2.1149 8.7671 12.8651 8.0786 7.7155 6.5044 1.0460 8.4207 4.2735 4.3289 6.9359 8.3732 112.4303 6.2493 0.0624 18.1450 17.1449 5.6838 28.7757 35.4666 22.0470 0.7387 6.5620 9.8741 2.0896 1.3073 8.4928 2.5145 1.7741 0.2272 1.0907 0.9479 6.1180 8.3051 4.1229 4.3950 1.1641 1.3363 1.0359 0.9029 11.8359 1.0265 0.2868 1.2121 0.9094 0.1125 1.5105 0.5176 2.4628 3.6896 1.7700 20.6430 0.2813 5.6070 0.5635 0.1605 0.9518 3.6731 0.8999 29.2444 11.4229 29.9324 3.2160 0.6022 0.7567 2.2399 1.2037 1.0835 1.9156 11.9414 12.2940 1.8138 13.1000 7.5903 6.2486 19.2757 6.7569 24.1424 166.9093 0.8450 1.8828 14.7999 9.3073 6.9931 13.7572 9.8022 241.6405 38.6586 43.8016 46.3765 20.4883 29.7027 5.8125 3.7334 1.2506 33.3374 1.1501 2.3746 13.1916 6.0172 35.9277 5.0395 60.8606 6.9470 185.3361 68.3119 26.0489 87.9406 63.0261 63.9537 6.3798 70.0128 17.9530
temp: 298.150 k
press: 1.00000 atm
elementType: 8 8 8 6 6 6 6 6 6 6 6 6 6 6 6 6 6 6 6 6 6 1 1 1 1 1 1 1 1 1 1 1 1 1 1 1 1 1 1 1 1 1 1 1 1 1 1 1 1 1 1 1 1 1 1
symmnumber: 1
zpe: 1282671.4 jmol-1
zpe.correction: 0.488544 hartree
zpe.thermalcorrener: 0.514765 hartree
zpe.thermalcorrenthalpy: 0.515709 hartree
zpe.thermalcorrgfe: 0.428674 hartree
zpe.sumelectzpe: -930.234480 hartree
zpe.sumelectthermal: -930.208259 hartree
zpe.sumelectthermalent: -930.207315 hartree
zpe.sumelectthermalfe: -930.294350 hartree
dipole: 2.1108 0.5883 0.7695
dipole: 2.3224
quadrupole: -157.5783 -127.3268 -134.6276
quadrupole: -0.2405 7.1101 -2.9371
quadrupole: -17.7340 12.5174 5.2166 -0.2405 7.1101 -2.9371
hfenergy: -930.7230239 hartree
pointgroup: C01 [X(C18H34O3)]
dipole: -0.818032 0.2674642 -0.3068242 debye
polarizability: 244.2577408|-1.1112866|195.4283872|0.5911449|0.5876518|165.6998719 unknown
InChI: InChI=1S/C18H34O3/c1-2-3-4-5-6-7-8-10-13-16-17(21-16)14-11-9-12-15-18(19)20/h16-17,19H,2-15H2,1H3
charge 0 multiplicity 1
55 atoms
O  5.644813 -0.448196 -0.35991
O  -3.432907 -2.28842 -1.320487
O  -2.949707 -2.344968 0.948808
C  4.491746 0.450462 0.05487
C  4.214732 -0.959185 -0.373979
C  4.195129 1.633544 -0.852008
C  3.876003 -2.053674 0.624545
C  2.700228 2.047634 -0.834104
C  2.390527 -2.028977 1.069499
C  2.197463 2.563061 0.536312
C  1.372489 -2.241091 -0.075255
C  0.7356 3.074571 0.510448
C  -0.315607 1.971637 0.243177
C  -0.084305 -2.265873 0.435937
C  -1.772933 2.482814 0.303853
C  -2.814853 1.370903 0.045059
C  -1.105161 -2.388683 -0.710866
C  -4.277243 1.867992 0.092169
C  -5.310526 0.750763 -0.185564
C  -2.543481 -2.344431 -0.233932
C  -6.770565 1.248587 -0.12031
H  4.494045 0.646669 1.137216
H  3.838692 -1.096213 -1.398959
H  4.494435 1.356189 -1.88105
H  4.826883 2.494353 -0.555326
H  4.530543 -1.925339 1.507718
H  4.12073 -3.041434 0.185735
H  2.543694 2.844465 -1.589586
H  2.087174 1.183178 -1.158451
H  2.237968 -2.815091 1.836269
H  2.175858 -1.060742 1.567252
H  2.28082 1.758151 1.295775
H  2.865119 3.382914 0.873182
H  1.478708 -1.429341 -0.823981
H  1.603353 -3.189723 -0.603989
H  0.639047 3.867633 -0.26074
H  0.503639 3.555929 1.482769
H  -0.138872 1.514668 -0.75222
H  -0.183042 1.158949 0.989468
H  -0.223574 -3.101565 1.147951
H  -0.291531 -1.340221 1.007195
H  -1.907516 3.295595 -0.440529
H  -1.960532 2.938325 1.298779
H  -2.620312 0.912176 -0.948443
H  -2.682667 0.563418 0.794983
H  -0.961391 -3.332578 -1.273855
H  -0.973445 -1.576332 -1.452043
H  -4.482252 2.312617 1.08848
H  -4.415105 2.684175 -0.647856
H  -5.110379 0.320716 -1.189867
H  -5.161794 -0.066809 0.550378
H  -6.948338 2.052584 -0.859366
H  -7.489526 0.434356 -0.327858
H  -7.004093 1.656725 0.881039
H  -4.365283 -2.227869 -0.975033
