program: Gaussian 09
title: 000187330
version: EM64L-G09RevD.01
frameworkgroup: C1[X(C20H13N)]
method: RPBEPBE
basis: SDD
operation: Freq
keyword: #pfreq=noraman
keyword: PBEPBE/SDD
title: #p freq=noraman PBEPBE/SDD
converged: YES YES NO NO
title: Mulliken charges:
elementType: N C C C C C C C C C C C C C C C C C C C C H H H H H H H H H H H H H
charge: -0.008875 0.214911 0.094313 0.453171 0.422999 0.356085 -0.585904 0.366137 0.401733 -0.717509 -0.499542 -0.466869 -0.449213 -0.388521 -0.672920 -0.260745 -0.430512 -0.421700 -0.243139 -0.241518 -0.148477 0.255692 0.247717 0.244783 0.238215 0.244677 0.236340 0.271335 0.296560 0.234019 0.252804 0.242535 0.231438 0.229979
chargesum: 0.00000
title: Mulliken charges with hydrogens summed into heavy atoms:
elementType: N C C C C C C C C C C C C C C C C C C C C
charge: -0.008875 0.214911 0.094313 0.453171 0.422999 0.356085 -0.330213 0.366137 0.401733 -0.469791 -0.254759 -0.228654 -0.204537 -0.152181 -0.105025 -0.026726 -0.177707 -0.179165 -0.011701 -0.011539 -0.148477
polarizability: 3.95866239e+02 1.58914284e+01 2.45944200e+02 3.15101437e+00 -1.86725398e+00 9.65077835e+01
1716.lowfreq: -6.6634 -0.0005 -0.0004 0.0004 3.1555 5.0306 38.8904 60.6993 68.9091
frequency: 38.8794 60.6977 68.9071 94.8445 128.6073 159.9584 180.6255 217.9641 267.3972 282.1897 305.4041 319.5022 369.0601 382.2768 401.1828 420.7338 464.5966 467.6001 475.6470 504.5584 517.6419 528.1605 563.2345 569.4975 596.0407 621.7013 652.6570 695.2859 715.6295 747.1643 756.3083 772.0825 782.2074 787.6936 806.0861 818.7712 848.1740 862.4395 894.0141 894.7445 908.5790 920.4751 924.9970 935.1219 967.3003 971.7998 976.9249 988.5532 993.1089 1009.2599 1018.8872 1094.9034 1126.7764 1157.3079 1172.7857 1173.7355 1191.5958 1199.0830 1212.3743 1230.1547 1250.1453 1275.6104 1286.9938 1298.4750 1301.3290 1327.2455 1372.8780 1397.3378 1412.1757 1423.3023 1434.1613 1440.5072 1447.0779 1458.7805 1483.7413 1495.9626 1560.4119 1569.3625 1592.1207 1607.2342 1629.8118 1638.0890 2190.2622 2999.6264 3054.1639 3117.8546 3121.4320 3122.2096 3124.6852 3127.4945 3131.8374 3144.5336 3146.7247 3162.6728 3163.3509 3181.5519
redmass: 5.9305 6.5614 5.5476 5.5572 5.3189 5.5112 4.0170 4.6432 4.0741 5.1930 5.9540 4.8181 4.8635 2.7799 3.3267 6.3417 4.5365 4.4086 2.7268 4.2330 3.4669 6.0962 3.5280 4.9490 4.6729 6.5717 4.9524 5.0326 4.0461 4.3784 1.3020 1.6619 2.3138 3.7198 3.7241 2.0117 2.3764 1.4481 2.0682 3.5812 2.0041 1.9691 1.8382 2.1379 2.0448 2.1340 1.3974 1.4107 1.3502 3.5759 2.2740 2.2006 1.7761 1.4518 1.1807 1.1889 1.1385 1.3021 1.9659 1.6068 2.0975 2.1349 2.3979 1.5936 1.4785 2.3222 4.8512 5.1423 2.1596 2.5854 3.7782 2.8683 3.2227 1.1181 2.8463 4.0524 5.5363 7.3462 5.6263 6.0174 6.8931 6.7245 12.4092 1.0596 1.0996 1.0909 1.0863 1.0860 1.0868 1.0890 1.0915 1.0952 1.0990 1.0995 1.1003 1.0894
irintensity: 1.4608 4.2608 0.6143 0.9154 1.9596 1.3725 1.2588 1.1548 0.2878 4.1486 2.6902 3.3723 0.1358 1.7273 0.7414 0.4867 0.7479 1.4380 14.8798 2.1823 2.2554 1.0741 0.8321 5.1373 2.7984 1.9814 1.8321 6.1180 10.7721 0.8792 44.8351 49.8213 11.3827 1.0883 2.9968 9.7565 17.9964 3.1201 20.3556 13.0414 3.2036 36.0270 6.8328 3.9488 2.9764 4.8621 6.4458 0.1078 0.0630 0.2444 6.1712 6.8958 1.8513 8.4584 1.6153 2.6158 1.5102 4.3637 2.7183 3.5252 3.5647 4.4081 1.3450 3.8916 1.7263 0.4972 4.4280 0.5014 6.0760 1.9980 3.1268 3.2431 5.2413 30.1922 8.9318 7.3746 2.5444 0.9756 1.3012 2.1011 0.4362 2.7499 9.5058 9.0991 1.0821 7.0920 0.5274 4.8687 2.2971 0.5914 13.3381 24.3882 37.9554 46.6127 31.3364 0.3411
temp: 298.150 k
press: 1.00000 atm
elementType: 7 6 6 6 6 6 6 6 6 6 6 6 6 6 6 6 6 6 6 6 6 1 1 1 1 1 1 1 1 1 1 1 1 1
symmnumber: 1
zpe: 692069.8 jmol-1
zpe.correction: 0.263595 hartree
zpe.thermalcorrener: 0.279076 hartree
zpe.thermalcorrenthalpy: 0.280021 hartree
zpe.thermalcorrgfe: 0.220697 hartree
zpe.sumelectzpe: -823.303668 hartree
zpe.sumelectthermal: -823.288187 hartree
zpe.sumelectthermalent: -823.287243 hartree
zpe.sumelectthermalfe: -823.346567 hartree
dipole: -0.4958 -3.0413 2.3819
dipole: 3.8947
quadrupole: -97.8824 -121.6667 -128.7152
quadrupole: 1.3015 -2.4970 10.3216
quadrupole: 18.2057 -5.5786 -12.6271 1.3015 -2.4970 10.3216
hfenergy: -823.5672638 hartree
pointgroup: C01 [X(C20H13N1)]
dipole: 0.1773347 -1.2493644 -0.869244 debye
polarizability: 395.7911345|-16.3867172|245.7913145|-0.3338176|-6.5273515|96.7357731 unknown
InChI: InChI=1S/C20H13N/c21-11-10-15-7-3-6-14-8-9-18-12-16-4-1-2-5-17(16)13-19(18)20(14)15/h1-9,12-13H,10H2
charge 0 multiplicity 1
34 atoms
N  1.03152 4.099359 0.628697
C  0.127841 -0.429553 -0.057733
C  1.599185 -0.27888 -0.117445
C  -0.442202 -1.774733 0.019312
C  2.407599 -1.44568 0.174977
C  2.303723 0.92475 -0.481848
C  -0.780924 0.651891 -0.003328
C  -2.19401 0.473871 0.008514
C  -2.745997 -0.868203 -0.023946
C  -1.840768 -1.960744 0.006786
C  0.430996 -2.917263 0.192581
C  1.788532 -2.749358 0.327569
C  3.825705 -1.350173 0.264419
C  3.711473 0.980037 -0.386643
C  1.641814 2.163554 -1.108233
C  4.478692 -0.136321 0.022029
C  -3.094423 1.594203 0.054829
C  -4.173611 -1.037977 -0.035848
C  -4.474584 1.397919 0.044193
C  -5.019336 0.069646 -0.006462
C  1.296091 3.230122 -0.14548
H  -0.423307 1.677487 0.101492
H  -2.237383 -2.982842 0.055329
H  -0.021773 -3.913068 0.260997
H  2.44306 -3.607735 0.517888
H  4.39929 -2.251102 0.511122
H  4.22189 1.912005 -0.657569
H  2.346625 2.602491 -1.839346
H  0.733629 1.887223 -1.673267
H  5.567672 -0.057703 0.100737
H  -2.677746 2.607671 0.096137
H  -4.586681 -2.053311 -0.063342
H  -5.153183 2.25718 0.075913
H  -6.10641 -0.065864 -0.015634
