program: Gaussian 09
title: 000187283
version: EM64L-G09RevD.01
frameworkgroup: C1[X(C9H10O3)]
method: RPBEPBE
basis: SDD
operation: Freq
keyword: #pfreq=noraman
keyword: PBEPBE/SDD
title: #p freq=noraman PBEPBE/SDD
converged: YES YES NO NO
title: Mulliken charges:
elementType: O O O C C C C C C C C C H H H H H H H H H H
charge: -0.446852 -0.416442 -0.235778 0.366300 0.287019 -0.662025 -0.392506 -0.510581 -0.404509 -0.232996 -0.232776 0.208895 0.301403 0.254337 0.238622 0.204196 0.265276 0.233002 0.230160 0.230488 0.339826 0.374941
chargesum: 0.00000
title: Mulliken charges with hydrogens summed into heavy atoms:
elementType: O O O C C C C C C C C C
charge: -0.107026 -0.041501 -0.235778 0.366300 0.287019 -0.106285 -0.153884 -0.041109 -0.171507 -0.002836 -0.002288 0.208895
polarizability: 1.25800918e+02 2.89633908e+00 1.08095945e+02 -1.07685972e+01 1.00625455e+01 7.35425968e+01
1716.lowfreq: -8.3415 -3.6336 -0.0011 -0.0009 -0.0008 4.4872 25.8246 68.1050 91.3904
frequency: 25.7629 68.0890 91.3901 97.6010 149.5312 229.3236 263.8587 325.2474 360.1238 368.3846 421.8205 450.5618 504.8872 513.8092 561.2599 600.9143 634.4528 673.2696 720.3313 758.6924 786.8891 844.7169 861.7261 889.0722 923.9080 939.5333 953.5212 968.8319 990.9274 1044.7136 1049.2997 1105.8290 1152.4434 1175.1150 1186.1098 1189.9737 1235.5521 1264.9328 1283.9929 1315.2289 1341.5253 1366.1138 1386.3052 1440.0924 1460.4406 1479.1374 1490.3731 1591.3400 1612.9921 1660.5769 2978.0220 2984.8989 3084.5472 3091.7670 3115.2475 3121.9345 3140.3845 3162.3320 3506.7302 3556.2552
redmass: 7.6124 6.8625 5.4857 3.9030 3.8561 4.3552 3.3132 4.1368 1.7366 2.6159 1.8845 3.0929 3.2066 2.6766 4.3364 4.4922 2.1587 2.1491 4.3171 1.3181 3.9267 3.7767 2.3160 2.0244 4.6432 1.9774 1.5255 1.6965 1.3331 2.2286 2.3343 1.8653 1.1490 1.0699 1.1945 2.4547 2.2252 1.6288 1.3744 1.2439 1.8692 1.2696 5.2058 2.3340 1.0866 1.4480 1.6269 6.6640 6.5147 8.1762 1.0667 1.0682 1.0938 1.0962 1.0873 1.0889 1.0928 1.1006 1.0638 1.0663
irintensity: 2.0157 0.1090 1.1650 3.2356 5.3266 0.8949 2.8614 3.5654 92.6472 5.7491 75.3603 6.4006 20.1444 30.8268 38.8089 16.5501 69.2904 84.4379 0.7759 76.8460 3.1713 14.6816 8.7782 1.9444 67.2595 23.0016 0.7326 0.3675 0.1371 90.5303 204.7389 49.1829 20.6348 0.7684 3.6818 5.9157 11.2537 3.4688 11.0981 9.9590 79.1708 21.8452 1.5214 7.1922 35.5994 17.1559 7.2184 0.6156 3.5586 185.1027 45.5169 46.5845 4.9866 3.2851 11.8584 2.8997 25.5805 27.6312 22.9872 5.9221
temp: 298.150 k
press: 1.00000 atm
elementType: 8 8 8 6 6 6 6 6 6 6 6 6 1 1 1 1 1 1 1 1 1 1
symmnumber: 1
zpe: 451905.2 jmol-1
zpe.correction: 0.172122 hartree
zpe.thermalcorrener: 0.183382 hartree
zpe.thermalcorrenthalpy: 0.184326 hartree
zpe.thermalcorrgfe: 0.133784 hartree
zpe.sumelectzpe: -573.741371 hartree
zpe.sumelectthermal: -573.730111 hartree
zpe.sumelectthermalent: -573.729166 hartree
zpe.sumelectthermalfe: -573.779708 hartree
dipole: -1.5799 -1.0116 -0.9361
dipole: 2.0966
quadrupole: -59.3710 -68.0192 -73.5373
quadrupole: -5.5096 0.3755 0.5505
quadrupole: 7.6049 -1.0434 -6.5615 -5.5096 0.3755 0.5505
hfenergy: -573.9134926 hartree
pointgroup: C01 [X(C9H10O3)]
dipole: -0.607527 0.3959675 0.3930629 debye
dipolederiv: -0.2101876 0.0067676 -0.0932324 0.0248175 -0.9311955 0.0764933 -0.1654608 0.1465472 -0.5549619 -1.1837198 -0.276265 -0.384791 -0.3476108 -0.5266074 -0.1223011 -0.2631085 -0.0884401 -0.3575065 -0.6746032 -0.0639689 0.0937122 -0.1862429 -0.3832518 -0.0851908 -0.0576511 -0.1782353 -0.9069184 0.3614007 -0.0189865 0.0447579 -0.025855 -0.0304725 -0.0240998 0.1206917 -0.0137588 -0.0777347 -0.0749074 -0.0259505 -0.0365643 -0.0294754 -0.0565628 0.0361294 -0.0342006 -0.0169963 -0.1206198 -0.2875123 -0.051998 0.111791 -0.1512962 -0.0215801 0.1135169 0.2252914 0.0857494 -0.0886112 -0.1420391 0.0636409 0.0741731 0.085312 -0.0144867 0.0847845 0.0539699 0.0695172 -0.0848903 0.2185488 -0.0029456 0.0686271 -0.062405 0.6070031 -0.0834502 0.0956147 -0.0918895 0.4859799 -0.0377841 0.0325337 0.0715733 0.0553291 -0.0475434 0.0844203 0.0816842 0.1014285 -0.0754921 -0.0269994 -0.0656709 0.0191541 -0.0598557 0.0593563 0.0652487 0.0269246 0.0563732 -0.1126147 0.0580391 -0.0504921 0.0824552 -0.0607587 -0.0710347 0.0100941 0.0764938 0.0024507 -0.1086004 1.563213 0.4333014 0.0708067 0.5883852 0.4205276 0.211415 -0.0191872 0.2468602 1.150496 0.1079217 0.0512102 0.0202462 0.1411581 0.1169372 0.0146741 0.0147685 -0.0028134 0.1031554 0.0330366 -0.003467 -0.0186106 -0.0260264 0.04694 -0.1158879 -0.0378294 -0.0606254 -0.0007623 0.0304639 -0.0797915 -0.090689 -0.0567083 0.0099723 -0.0696915 -0.0810985 -0.0860433 0.0760094 -0.0465508 -0.1117662 -0.1643373 -0.035509 -0.0254158 -0.0300791 -0.0930256 -0.0473212 -0.0653723 -0.011805 0.0687911 0.082058 0.0596606 0.0603829 0.0276456 0.0192328 0.0417921 0.0520048 0.0354777 -0.0478866 -0.0612678 -0.0825845 -0.0116425 -0.0994152 -0.0852514 -0.0875258 0.0772779 0.055696 0.080917 -0.0062751 0.0939104 -0.0768847 -0.059958 -0.006865 -0.0646025 0.1289598 -0.0919944 0.0654571 -0.0809242 0.0570555 0.0786858 -0.007051 -0.085198 -0.0046879 0.1215186 0.0367994 0.006328 0.1055441 0.0325911 0.4233501 0.0040754 0.0771575 0.0055023 0.2236741 0.2875063 -0.0097585 0.0917929 -0.0138917 0.3735225 -0.0313728 0.1370467 -0.0132815 0.1350087 unknown
polarizability: 124.354388|-5.9419909|106.0041415|12.8209844|12.8179363|77.0809306 unknown
InChI: InChI=1S/C9H10O3/c10-6-8-4-2-1-3-7(8)5-9(11)12/h1-4,10-11H,5-6H2
charge 0 multiplicity 1
22 atoms
O  -0.046274 -2.83198 0.610392
O  3.498243 0.742904 0.392696
O  2.254027 -0.113761 -1.366818
C  -0.136505 0.294872 0.449004
C  -0.913885 -0.657329 -0.275042
C  1.277183 -0.029675 0.920342
C  -0.691654 1.563885 0.736957
C  -0.367739 -2.037803 -0.604156
C  -2.221456 -0.306308 -0.691596
C  -1.996776 1.905636 0.313513
C  -2.766739 0.965911 -0.405861
C  2.334067 0.179656 -0.153732
H  1.326661 -1.097867 1.214858
H  1.553293 0.573875 1.799565
H  -0.094226 2.293952 1.296564
H  -1.086364 -2.589341 -1.242632
H  0.593264 -1.967096 -1.137307
H  -2.817867 -1.039468 -1.24939
H  -2.406638 2.894812 0.545517
H  -3.779165 1.218691 -0.739363
H  -0.870071 -2.919192 1.154431
H  4.185621 0.826924 -0.323644
