program: Gaussian 09
title: 000187318
version: EM64L-G09RevD.01
frameworkgroup: C1[X(C14H5Br2F7O2)]
method: RPBEPBE
basis: SDD
operation: Freq
keyword: #p
keyword: freq=noraman
keyword: PBEPBE/SDD
title: #p freq=noraman PBEPBE/SDD
converged: YES YES NO NO
title: Mulliken charges:
elementType: Br Br F F F F F F F O O C C C C C C C C C C C C C C H H H H H
charge: 0.069329 0.033294 -0.130466 -0.120474 -0.133956 -0.128915 -0.139474 -0.120819 -0.118769 -0.260306 -0.130762 0.249914 0.205087 0.495579 0.402886 0.570651 0.371383 0.156487 -0.655879 -0.437064 -0.334798 -0.370596 -0.349868 -0.201774 -0.236074 0.254386 0.272912 0.260211 0.267756 0.260121
chargesum: 0.00000
title: Mulliken charges with hydrogens summed into heavy atoms:
elementType: Br Br F F F F F F F O O C C C C C C C C C C C C C C
charge: 0.069329 0.033294 -0.130466 -0.120474 -0.133956 -0.128915 -0.139474 -0.120819 -0.118769 -0.260306 -0.130762 0.249914 0.205087 0.495579 0.402886 0.570651 0.371383 0.156487 -0.655879 -0.182679 -0.061886 -0.110385 -0.082112 0.058347 -0.236074
polarizability: 3.39086327e+02 1.09558214e+01 1.95148914e+02 -1.34471248e+01 1.05512698e+01 9.57960071e+01
1716.lowfreq: -2.3546 -0.0010 -0.0006 -0.0002 2.6951 5.6542 10.1838 18.0347 22.5265
frequency: 10.1213 18.0230 22.5183 30.4782 49.2623 66.6974 74.7066 89.3543 101.5162 113.3040 135.7540 163.2379 185.6215 195.8462 196.8904 224.4527 232.1864 243.6460 259.3761 282.8230 289.3042 302.5283 319.3949 338.8153 346.9333 373.0488 374.5659 413.1364 440.9417 456.6127 480.8110 505.7199 522.6495 524.4744 535.6819 549.3603 562.5549 585.1178 646.7863 653.0488 658.2103 680.5119 731.8790 753.0412 781.1437 813.1696 823.8145 839.8645 871.3501 894.5706 902.2739 954.6324 964.8617 979.3320 991.5784 1019.7550 1033.4378 1046.2285 1064.9179 1068.6756 1086.2401 1139.7540 1146.4785 1164.5028 1172.5103 1199.5550 1206.3096 1226.6500 1260.4043 1313.2952 1372.8524 1402.3828 1410.6990 1449.4028 1490.6861 1564.3281 1589.0077 1622.3183 1671.0555 3151.4552 3158.1329 3159.7784 3180.5572 3185.8137
redmass: 18.4193 17.9887 11.9136 16.2612 18.6922 9.1589 11.5459 17.1645 9.1887 20.4517 16.0122 15.8746 8.0115 13.8392 9.2304 6.1095 13.5530 16.6877 15.7739 17.4158 16.2284 14.3533 14.6122 16.4975 7.4905 8.8658 10.0947 3.2158 14.2309 11.3226 7.9530 12.1500 5.3860 4.3945 11.3028 11.8621 4.6007 13.5143 5.1715 10.4419 7.1624 13.0172 8.4868 4.5430 3.0354 1.5703 5.8906 1.7280 10.2463 1.5843 8.3169 6.1009 1.4229 1.3454 11.2277 13.1452 12.9044 12.1153 11.6811 2.3548 12.5232 11.4885 1.7503 1.3464 6.3057 3.1090 11.7070 1.8660 1.6206 2.1402 3.3491 6.4335 5.1290 2.6331 3.9515 8.8839 6.5150 7.4872 13.1373 1.0901 1.0920 1.0887 1.0972 1.0964
irintensity: 0.0328 0.0152 0.3146 0.1323 0.4174 0.0976 0.1498 0.6105 0.0122 0.2611 0.4537 0.8547 1.4573 7.0209 0.2310 2.9570 3.3282 2.1787 3.9245 2.2030 4.5723 5.1461 1.6212 1.1480 6.1558 2.5137 3.3743 5.1863 8.4515 4.5857 2.6200 5.8631 2.0912 9.6256 5.4872 1.3606 0.8793 16.3117 11.0778 16.5249 17.0234 13.6083 16.5335 43.1437 14.8096 23.9026 38.0730 49.9759 64.0691 18.1439 133.2109 47.0007 3.7750 1.1209 134.4503 55.4609 17.7947 12.4854 530.6271 94.0159 298.7242 43.8836 2.9690 2.6839 161.3592 174.3809 39.9877 44.9469 21.7020 27.5380 2.5150 35.8243 0.9436 3.5052 44.0953 31.4935 66.9122 9.4121 288.9961 3.1212 1.6543 0.7028 3.0456 0.5437
temp: 298.150 k
press: 1.00000 atm
elementType: 35 35 9 9 9 9 9 9 9 8 8 6 6 6 6 6 6 6 6 6 6 6 6 6 6 1 1 1 1 1
symmnumber: 1
zpe: 425360.5 jmol-1
zpe.correction: 0.162011 hartree
zpe.thermalcorrener: 0.185328 hartree
zpe.thermalcorrenthalpy: 0.186273 hartree
zpe.thermalcorrgfe: 0.104107 hartree
zpe.sumelectzpe: -1410.928355 hartree
zpe.sumelectthermal: -1410.905038 hartree
zpe.sumelectthermalent: -1410.904094 hartree
zpe.sumelectthermalfe: -1410.986259 hartree
dipole: -3.2233 0.2667 -0.3435
dipole: 3.2525
quadrupole: -170.9697 -149.0624 -166.6975
quadrupole: -4.4028 0.6766 -2.6721
quadrupole: -8.7265 13.1808 -4.4543 -4.4028 0.6766 -2.6721
hfenergy: -1411.0903663 hartree
pointgroup: C01 [X(C14H5Br2F7O2)]
dipole: 1.2708215 0.1125434 0.0988846 debye
polarizability: 338.3822214|-18.1107443|180.250624|-9.7845477|-37.5099153|111.3984026 unknown
InChI: InChI=1S/C14H5Br2F7O2/c15-7-2-3-8-6(5-7)1-4-9(10(8)16)25-11(24)12(17,18)13(19,20)14(21,22)23/h1-5H
charge 0 multiplicity 1
30 atoms
Br 0.479675 -2.012506 1.225379
Br 7.622679 -0.397804 -0.22918
F  -4.983847 -0.020665 0.987021
F  -2.941218 -0.928217 1.450653
F  -2.962201 1.834942 1.448168
F  -3.898455 1.89172 -0.634894
F  -2.557467 -1.400332 -1.352248
F  -4.349511 -2.416202 -0.392331
F  -4.659382 -0.628133 -1.748749
O  -0.69826 0.686163 0.464167
O  -1.384928 1.595038 -1.60292
C  -3.685709 -0.239611 0.469793
C  -3.021428 1.161084 0.199183
C  2.862191 -0.486368 0.371291
C  3.509961 0.703195 -0.154188
C  0.707655 0.681083 0.188199
C  -3.824706 -1.180815 -0.775673
C  -1.605621 1.178294 -0.459668
C  1.432991 -0.462424 0.532637
C  2.724838 1.853523 -0.48923
C  1.344529 1.851098 -0.320854
C  3.676445 -1.618397 0.701241
C  4.932718 0.712316 -0.327513
C  5.060863 -1.590293 0.525832
C  5.679016 -0.413153 0.00828
H  3.224802 2.745134 -0.880894
H  0.744406 2.727668 -0.575754
H  3.203262 -2.521168 1.097498
H  5.415952 1.610115 -0.724539
H  5.670253 -2.461387 0.781093
