program: Gaussian 09
title: 000184991
version: EM64L-G09RevD.01
frameworkgroup: C1[X(C17H25N3O3)]
method: RPBEPBE
basis: SDD
operation: Freq
keyword: #p
keyword: freq=noraman
keyword: PBEPBE/SDD
title: #p freq=noraman PBEPBE/SDD
converged: YES YES NO NO
title: Mulliken charges:
elementType: O O O N N N C C C C C C C C C C C C C C C C C H H H H H H H H H H H H H H H H H H H H H H H H H
charge: -0.242605 -0.268476 -0.223867 -0.203169 -0.329486 -0.373329 -0.036187 -0.372047 -0.351746 -0.509922 -0.345856 -0.703427 -0.692875 0.223328 0.431977 -0.694610 0.103933 0.107411 -0.361473 -0.348320 -0.219098 -0.221096 -0.249005 0.228496 0.218639 0.248105 0.223109 0.203006 0.229007 0.264642 0.189701 0.192090 0.204142 0.225848 0.219435 0.204564 0.222102 0.221354 0.348019 0.214309 0.211239 0.214630 0.369437 0.241450 0.301934 0.226761 0.227707 0.230218
chargesum: 0.00000
title: Mulliken charges with hydrogens summed into heavy atoms:
elementType: O O O N N N C C C C C C C C C C C C C C C C C
charge: -0.242605 -0.268476 -0.223867 -0.203169 0.018533 -0.003892 0.192310 0.094698 0.074369 -0.016272 0.035934 -0.054001 -0.044855 0.223328 0.431977 -0.054432 0.103933 0.107411 -0.120023 -0.046386 0.007662 0.006611 -0.018787
polarizability: 2.78303297e+02 -1.29442085e+01 2.40219718e+02 -5.13151684e+00 4.16562819e+00 1.46622591e+02
1716.lowfreq: -8.2494 -0.0005 0.0006 0.0007 1.7355 3.7747 15.1888 15.6656 21.4454
frequency: 14.8490 15.3778 21.2354 27.7084 41.3766 43.2877 54.2492 60.9343 69.6274 75.8315 89.0635 103.0969 134.3816 154.7639 159.6326 211.3475 223.6831 226.9547 231.8817 234.0035 252.5154 263.3311 286.4226 302.0429 327.3736 347.5595 371.6880 398.7408 405.1680 414.7152 443.1767 472.3938 501.3422 506.9040 527.6689 553.1695 613.2494 615.8781 651.2402 690.3488 717.7086 724.4705 728.4675 732.0790 765.1551 772.7594 774.0704 797.8090 819.2028 839.4365 871.6028 889.2006 903.5301 915.9671 919.3689 922.2031 925.1282 953.4155 968.1993 974.0246 984.7873 994.1426 1025.0785 1031.8617 1038.1812 1082.9286 1092.0970 1094.9124 1104.3258 1122.5028 1137.7877 1155.5341 1163.3025 1175.0287 1179.8983 1196.1665 1207.3677 1220.9324 1236.6612 1256.9104 1265.5237 1271.9136 1278.7783 1287.5967 1299.8618 1327.1390 1336.4068 1337.4488 1354.5979 1357.2133 1380.5339 1381.6058 1391.2758 1398.4534 1440.9414 1444.9639 1450.9741 1466.8042 1468.0962 1472.1734 1475.6367 1475.9524 1476.8753 1478.8688 1483.3186 1488.1374 1489.7952 1504.8272 1589.1999 1607.4008 1615.9049 1628.7974 1639.2587 2960.9409 2968.6786 2972.7390 2973.1699 2974.3156 2984.7712 2995.1531 2997.9723 3005.8272 3025.1581 3060.4774 3060.7084 3064.9399 3071.8651 3072.4947 3073.5382 3074.6842 3079.6916 3131.1342 3141.9464 3160.9661 3174.4503 3214.6079 3428.1020 3491.4184
redmass: 3.9975 3.7852 3.4293 4.7581 3.4674 5.6932 1.6691 4.0415 4.3370 5.9357 4.0882 5.4649 1.9638 4.1183 4.1975 1.1999 1.9323 2.7078 1.3066 2.0815 2.6661 4.0488 2.5967 4.4939 5.6786 6.8381 2.3939 3.7658 2.7218 2.6208 3.3468 5.6467 5.4662 3.8666 5.6269 3.0619 6.2835 5.8844 5.3640 1.8590 1.2687 1.1501 1.0975 4.7309 1.7051 4.0035 7.4830 1.2736 2.5365 1.2507 3.1229 4.5252 1.7723 1.4463 1.2571 1.2964 2.4308 1.4446 1.8855 1.3713 5.4009 1.3338 3.7874 3.0129 2.9270 2.2361 1.8272 1.9509 1.7345 3.0290 2.3119 2.0018 2.9573 1.0516 1.8400 1.1516 1.4627 2.0937 2.0106 3.0921 1.4354 1.7719 1.1852 1.0711 1.2720 1.3688 1.3845 1.6071 1.3468 1.6912 1.2245 8.7699 1.2159 1.2122 1.2599 1.8417 1.1059 1.0712 1.0563 1.6846 1.1209 1.0702 1.0429 2.1361 1.0697 1.0808 1.0551 1.9123 6.3239 6.1835 9.3776 7.4971 10.6198 1.0591 1.0364 1.0371 1.0562 1.0395 1.0751 1.0646 1.0694 1.0961 1.0986 1.1022 1.0993 1.1005 1.0999 1.1002 1.1004 1.1001 1.0991 1.0852 1.0905 1.0954 1.0973 1.0942 1.0779 1.0770
irintensity: 0.5570 0.1496 0.0831 0.7938 0.5807 0.5159 0.3067 0.7041 0.3266 1.1289 3.0822 5.5593 1.3832 6.9721 2.3919 0.1411 0.7566 0.7964 0.0375 7.3465 1.8602 8.2309 11.2197 0.8803 9.6904 2.4450 8.0318 6.1985 1.2185 6.6463 4.6226 11.3217 9.6865 5.4990 24.4268 4.7217 2.8117 6.0200 17.8273 46.1115 120.3071 99.1728 10.8282 12.4017 71.0135 5.9383 2.3101 0.4665 20.0799 2.6312 15.2271 14.0891 11.1346 5.4295 4.4606 4.5835 7.9477 0.9624 0.3364 1.2201 0.1285 0.8519 2.7681 5.2549 3.5519 1.2960 5.2573 21.0147 0.6752 34.1786 2.5777 10.6137 75.9414 1.9393 12.8354 9.4438 1.3088 9.2752 71.9605 76.4399 35.0029 168.6215 0.9049 2.8039 1.0363 4.3769 14.6429 63.6493 3.4342 9.0086 22.9862 4.6432 14.7513 20.1106 42.4053 0.8313 23.7473 1.8907 2.3014 209.9882 22.8340 5.1507 12.8122 138.9603 14.3465 16.8837 19.8318 153.8176 0.5269 55.8402 174.9344 258.5094 56.8441 32.6278 29.8121 30.4655 17.0178 24.2171 4.4432 33.0886 42.0104 16.0294 0.8012 4.4996 18.1176 18.9144 42.2258 67.4208 69.4599 48.9158 50.3539 0.3704 16.4858 34.8314 10.7025 5.2322 59.2345 47.0892
temp: 298.150 k
press: 1.00000 atm
elementType: 8 8 8 7 7 7 6 6 6 6 6 6 6 6 6 6 6 6 6 6 6 6 6 1 1 1 1 1 1 1 1 1 1 1 1 1 1 1 1 1 1 1 1 1 1 1 1 1
symmnumber: 1
zpe: 1047201.7 jmol-1
zpe.correction: 0.398858 hartree
zpe.thermalcorrener: 0.424036 hartree
zpe.thermalcorrenthalpy: 0.424980 hartree
zpe.thermalcorrgfe: 0.338702 hartree
zpe.sumelectzpe: -1050.999869 hartree
zpe.sumelectthermal: -1050.974691 hartree
zpe.sumelectthermalent: -1050.973747 hartree
zpe.sumelectthermalfe: -1051.060026 hartree
dipole: -4.3401 -1.2527 -0.7400
dipole: 4.5775
quadrupole: -124.4031 -131.4000 -147.0012
quadrupole: -5.1706 -9.1796 -5.4969
quadrupole: 9.8650 2.8681 -12.7331 -5.1706 -9.1796 -5.4969
hfenergy: -1051.3987273 hartree
pointgroup: C01 [X(C17H25N3O3)]
dipole: 1.5439364 -0.8894549 0.2617195 debye
polarizability: 282.2752787|3.6447938|236.0864529|-0.0250633|6.7333121|146.783875 unknown
InChI: InChI=1S/C17H25N3O3/c1-4-5-11-15(21)20(14-9-7-6-8-10-14)19-17(23)16(22)18-12-13(2)3/h6-10,13,18-19H,4-5,11-12H2,1-3H3
charge 0 multiplicity 1
48 atoms
O  -2.513219 2.582769 -0.172907
O  1.55805 -1.790054 1.52818
O  0.687923 -0.031687 -1.500053
N  -1.595447 0.474156 0.259312
N  2.712564 -1.629571 -0.519728
N  -0.426041 -0.237951 0.573963
C  5.102814 -1.617981 0.318077
C  3.873671 -2.449675 -0.143136
C  -0.236244 4.053624 0.621175
C  -0.152621 2.519351 0.488739
C  1.147452 4.688337 0.883361
C  5.616913 -0.683634 -0.800908
C  6.213366 -2.580394 0.798085
C  -1.510574 1.896755 0.161597
C  -2.779496 -0.331315 0.022254
C  1.077427 6.224884 1.017868
C  1.680544 -1.366582 0.331873
C  0.596591 -0.475325 -0.319053
C  -2.626932 -1.72597 -0.200151
C  -4.084119 0.233116 0.045175
C  -3.760379 -2.542551 -0.395533
C  -5.205827 -0.599298 -0.154789
C  -5.05892 -1.987302 -0.374343
H  4.776773 -0.99826 1.177565
H  4.156867 -3.078052 -1.009937
H  3.549761 -3.113444 0.678296
H  -0.678071 4.474627 -0.300952
H  -0.931956 4.31866 1.440911
H  0.255557 2.072158 1.416244
H  0.555613 2.253463 -0.322077
H  1.586187 4.256702 1.806854
H  1.836856 4.421047 0.056093
H  5.945551 -1.26795 -1.682785
H  6.483265 -0.094323 -0.44982
H  4.840765 0.032341 -1.129009
H  6.552951 -3.23567 -0.027435
H  5.86263 -3.225285 1.6250
H  7.091449 -2.014904 1.158689
H  2.645113 -1.19973 -1.449517
H  0.674714 6.684496 0.095871
H  0.416087 6.519658 1.854296
H  2.07571 6.661071 1.205724
H  -0.347165 -0.686956 1.498157
H  -1.631962 -2.177903 -0.228428
H  -4.210627 1.304952 0.191805
H  -3.621786 -3.615591 -0.567712
H  -6.204825 -0.149606 -0.137818
H  -5.937353 -2.623001 -0.527374
