program: Gaussian 09
title: 000187286
version: EM64L-G09RevD.01
frameworkgroup: C1[X(C15H14N4S)]
method: RPBEPBE
basis: SDD
operation: Freq
keyword: #p
keyword: freq=noraman
keyword: PBEPBE/SDD
title: #p freq=noraman PBEPBE/SDD
converged: YES YES NO NO
title: Mulliken charges:
elementType: S N N N N C C C C C C C C C C C C C C C H H H H H H H H H H H H H H
charge: 0.351578 -0.148343 -0.111395 -0.136587 -0.308993 0.414749 0.562429 -0.331633 -0.314508 -0.443164 0.155708 0.187337 -0.460552 -0.363866 -0.312648 -0.644441 -0.645456 -0.226903 -0.352350 -0.330760 0.241167 0.239034 0.288539 0.245870 0.272061 0.240520 0.240885 0.220647 0.240815 0.220687 0.241015 0.246154 0.252956 0.269447
chargesum: 0.00000
title: Mulliken charges with hydrogens summed into heavy atoms:
elementType: S N N N N C C C C C C C C C C C C C C C
charge: 0.351578 -0.148343 -0.111395 -0.136587 -0.308993 0.414749 0.562429 -0.090465 -0.075473 -0.443164 0.155708 0.187337 -0.172013 -0.117996 -0.040587 0.057610 0.057062 0.019252 -0.099394 -0.061313
polarizability: 6.00552532e+02 -5.90045696e+00 2.02847127e+02 -1.34526231e-01 1.86804534e-01 8.76738296e+01
1716.lowfreq: -9.2758 -4.3989 -3.4128 -0.0012 0.0009 0.0014 20.1838 30.9626 44.5103
frequency: 19.9126 30.8137 44.4856 70.8963 78.0827 117.9733 137.4685 147.2837 182.1091 193.6816 198.9790 200.3945 259.5762 261.0092 341.9267 345.1193 392.7534 395.4028 425.4170 434.9187 457.2099 471.5090 489.9598 500.0558 529.6641 531.0203 549.2195 565.3933 630.0329 637.1250 664.5212 708.3066 732.1310 736.9564 745.1422 805.5076 815.4122 829.8155 836.0654 866.6212 877.8806 938.2570 939.1927 956.8060 962.9952 972.7091 983.0143 986.9335 1035.6755 1057.0865 1104.5951 1111.0661 1112.2013 1123.9280 1136.8532 1161.2034 1166.1328 1210.6550 1233.2495 1244.1473 1254.1599 1281.9115 1306.6155 1337.9237 1363.3881 1371.6956 1384.2507 1400.0203 1432.6775 1438.4011 1456.8821 1459.3314 1466.4601 1469.3244 1478.6997 1490.6284 1499.0116 1520.6528 1550.5277 1556.4961 1593.6923 1624.8152 2951.0020 2957.7532 3020.4842 3023.4005 3102.1702 3112.3450 3146.7149 3148.3876 3148.5053 3150.4061 3161.6816 3169.5688 3169.9846 3174.5629
redmass: 4.1876 5.5296 6.1735 5.6660 2.3241 1.6081 6.0646 2.8005 3.5759 1.5572 5.2388 3.5323 4.0026 3.4467 6.3915 5.3406 4.5833 4.6123 3.6425 3.4874 4.3191 4.3015 3.9121 9.1066 5.3919 2.5187 5.5640 7.5617 7.2298 3.1264 6.3005 6.7716 3.4212 6.4600 3.6930 1.2619 6.7323 1.5587 1.5752 1.4135 6.3151 3.0463 1.5853 3.1131 1.3589 1.3629 1.3387 2.8598 6.0858 1.5062 1.2372 1.9956 1.3338 1.4236 1.4341 1.3997 1.5825 1.4411 2.4935 1.6451 2.9047 2.7539 1.4946 7.2779 3.2601 4.8227 5.6616 4.1402 1.2099 4.4409 2.0053 1.6101 1.0394 3.9100 1.0452 1.1388 1.3257 1.9914 6.3745 7.7362 6.9510 6.2517 1.0366 1.0390 1.0997 1.1029 1.0969 1.0948 1.0881 1.0903 1.0906 1.0866 1.0917 1.0972 1.0955 1.0956
irintensity: 0.1582 0.5863 0.5617 1.3215 0.0539 3.3601 0.2869 0.2638 1.0416 0.1914 0.2818 0.6967 1.9428 3.9645 4.2589 3.6534 5.2210 0.9356 0.0629 0.2640 25.9751 7.4438 14.5788 3.6709 8.0126 30.5956 1.9474 19.6227 5.9114 2.2791 2.9206 12.4768 5.5580 1.9121 6.4088 2.1737 20.0881 6.8813 100.9009 7.0476 0.2339 40.0680 35.0488 0.5297 2.6823 0.4180 1.5124 0.1750 37.9007 25.8563 0.0369 9.6268 1.0744 9.3537 31.3206 135.3618 140.8367 12.9145 0.2745 5.2928 24.3887 6.2913 35.3885 483.0713 196.5059 24.6013 9.0691 1.7722 6.3904 22.7871 9.1782 17.1155 0.0117 37.7132 24.1843 0.8019 12.6101 231.6380 59.4476 0.4568 18.1972 643.8117 86.0313 202.6483 4.7953 70.2524 4.0722 47.8498 4.8482 5.1932 1.7883 4.7230 0.7448 9.6006 20.3990 23.4518
temp: 298.150 k
press: 1.00000 atm
elementType: 16 7 7 7 7 6 6 6 6 6 6 6 6 6 6 6 6 6 6 6 1 1 1 1 1 1 1 1 1 1 1 1 1 1
symmnumber: 1
zpe: 681087.8 jmol-1
zpe.correction: 0.259413 hartree
zpe.thermalcorrener: 0.277276 hartree
zpe.thermalcorrenthalpy: 0.278220 hartree
zpe.thermalcorrgfe: 0.211685 hartree
zpe.sumelectzpe: -1195.599231 hartree
zpe.sumelectthermal: -1195.581367 hartree
zpe.sumelectthermalent: -1195.580423 hartree
zpe.sumelectthermalfe: -1195.646958 hartree
dipole: -9.4937 -1.0648 0.0000
dipole: 9.5532
quadrupole: -98.5978 -111.1800 -130.1907
quadrupole: -11.0107 -0.1147 -0.0373
quadrupole: 14.7250 2.1428 -16.8678 -11.0107 -0.1147 -0.0373
hfenergy: -1195.8586435 hartree
pointgroup: C01 [X(C15H14N4S1)]
dipole: 3.7259498 0.1368953 0.4743378 debye
polarizability: 600.278014|13.6126745|88.7560744|-0.0736156|9.0791863|202.0394005 unknown
InChI: InChI=1S/C15H14N4S/c1-19(2)14-6-3-12(4-7-14)17-18-13-5-8-15-11(9-13)10-16-20-15/h3-10H,1-2H3
charge 0 multiplicity 1
34 atoms
S  -6.504746 -0.163883 0.114741
N  5.857754 0.158627 0.041502
N  0.195349 -0.01316 -0.298486
N  -0.507936 0.052783 0.811791
N  -6.164873 -0.312972 -1.689554
C  4.466707 0.116839 -0.01717
C  -3.97149 -0.16774 -0.703161
C  3.777959 0.012879 -1.271872
C  3.672674 0.175437 1.182158
C  -4.743255 -0.082674 0.503723
C  1.59966 0.034505 -0.125666
C  -1.924607 -0.000499 0.60849
C  -2.560572 -0.126113 -0.651134
C  2.378536 -0.026958 -1.314724
C  2.277422 0.135975 1.127291
C  6.650763 0.102966 -1.195725
C  6.544709 0.258725 1.338356
C  -4.114314 0.042702 1.762394
C  -2.709481 0.081916 1.801195
C  -4.839443 -0.292702 -1.863887
H  4.338889 -0.038001 -2.208503
H  4.160726 0.252656 2.157718
H  -1.945717 -0.18854 -1.554162
H  1.850276 -0.106578 -2.27095
H  1.67701 0.181912 2.041274
H  6.47971 -0.841679 -1.749528
H  6.409736 0.946597 -1.872682
H  7.72166 0.16219 -0.947667
H  6.267327 1.185708 1.878634
H  7.633215 0.274958 1.174571
H  6.311302 -0.6041 1.993203
H  -4.697045 0.107853 2.685956
H  -2.175628 0.177691 2.752254
H  -4.479179 -0.37342 -2.895382
