program: Gaussian 09
title: 000187285
version: EM64L-G09RevD.01
frameworkgroup: C1[X(C15H14N4S)]
method: RPBEPBE
basis: SDD
operation: Freq
keyword: #p
keyword: freq=noraman
keyword: PBEPBE/SDD
title: #p freq=noraman PBEPBE/SDD
converged: YES YES NO NO
title: Mulliken charges:
elementType: S N N N N C C C C C C C C C C C C C C C H H H H H H H H H H H H H H
charge: 0.345911 -0.147484 -0.109481 -0.133613 -0.312806 0.415179 0.510084 -0.313095 -0.330549 -0.372473 0.150484 0.189760 -0.309213 -0.362367 -0.396877 -0.361196 -0.645422 -0.644268 -0.300982 -0.335741 0.239953 0.241691 0.273108 0.246865 0.266426 0.241264 0.241814 0.241852 0.221263 0.241434 0.221286 0.241194 0.277284 0.268715
chargesum: 0.00000
title: Mulliken charges with hydrogens summed into heavy atoms:
elementType: S N N N N C C C C C C C C C C C C C C C
charge: 0.345911 -0.147484 -0.109481 -0.133613 -0.312806 0.415179 0.510084 -0.073142 -0.088858 -0.372473 0.150484 0.189760 -0.036105 -0.115502 -0.130451 -0.119931 0.059507 0.059647 -0.023697 -0.067026
polarizability: 6.41783126e+02 7.75755966e-01 2.02310924e+02 1.02277185e-01 1.39669608e-01 8.76105203e+01
1716.lowfreq: -8.0786 -7.1720 -0.0012 -0.0008 -0.0002 2.3265 20.4389 29.2204 42.9409
frequency: 19.6828 29.2006 42.8736 63.8943 74.1435 118.0157 146.5129 155.9566 178.9872 180.1275 189.2654 207.4772 251.9061 259.5012 330.4140 342.5994 380.8224 392.4276 429.8277 441.9262 457.8187 479.1020 493.8036 505.3003 529.5980 537.6384 541.0809 590.6099 618.1455 629.6864 680.1960 699.3417 734.7162 739.8870 747.9445 805.5849 825.4303 832.2149 836.6033 872.8488 885.0132 898.5015 910.5615 937.5575 964.1987 985.4235 986.2491 991.6103 1022.0880 1053.4656 1101.4170 1110.3312 1118.9947 1124.6731 1150.3441 1161.8846 1178.2863 1206.9661 1237.8024 1253.2110 1259.8631 1275.3939 1306.3738 1327.6637 1360.7462 1365.6632 1381.4560 1406.5275 1429.1563 1445.3666 1452.8118 1457.6294 1460.0899 1464.2752 1477.7235 1490.2635 1498.1704 1520.4247 1547.1577 1550.5067 1599.5360 1624.9860 2951.2926 2958.2065 3021.3475 3024.9451 3101.8912 3112.6616 3137.1189 3147.4092 3149.0161 3151.5260 3166.1550 3170.6811 3174.6141 3174.8633
redmass: 3.9980 5.1090 6.1246 2.8332 3.5421 1.5768 2.7190 5.3913 3.6765 4.8172 1.4767 5.4844 4.3374 3.3950 7.1587 5.4883 4.3233 4.9309 3.0337 3.4654 4.7615 4.9978 5.1566 4.6556 2.4470 9.8776 5.1817 6.1283 3.3391 7.1989 6.6647 7.3101 3.4814 6.2152 3.6566 1.2710 5.7230 1.4939 1.5408 6.6690 1.5237 1.5073 6.1661 3.0268 1.3560 1.3326 2.8690 1.3386 2.7219 1.5179 1.2378 1.3311 1.4230 1.3029 2.1180 1.6928 1.5820 1.2773 2.2271 2.8902 2.0855 3.0154 1.5686 5.8477 3.5986 3.4615 5.0698 4.6517 1.1797 5.9395 1.5307 2.9568 2.3980 1.0402 1.0456 1.1484 1.3155 2.0641 6.6508 6.6327 7.1106 6.2581 1.0364 1.0388 1.1000 1.1026 1.0972 1.0949 1.0898 1.0881 1.0931 1.0867 1.0922 1.0954 1.0954 1.0951
irintensity: 0.0272 1.7450 1.3872 0.3939 0.7165 3.1701 0.1724 1.6204 0.6927 0.5296 0.2849 0.7709 0.2117 5.7984 0.3477 0.5336 3.3639 0.0201 1.5041 2.2225 1.8332 15.7297 3.9325 26.9727 4.8374 2.9970 24.7122 7.2542 22.4988 2.3247 2.9188 25.0390 0.0035 4.3727 3.4474 3.7416 0.8340 15.6196 63.0749 32.4055 25.0659 50.9229 15.4793 42.0418 2.0352 1.1188 0.4742 0.4106 15.1838 25.9592 0.0338 1.0331 4.6806 11.0942 219.3473 0.0817 120.3252 26.3349 16.5573 18.2368 6.6011 4.6554 112.5560 620.8677 132.7128 128.6295 17.1097 17.4332 6.2705 10.1429 10.8600 20.5556 4.1748 0.2477 24.3597 0.6474 23.1646 211.1704 7.9614 63.5267 104.8191 650.2025 87.8758 208.2524 10.6318 62.3360 3.6843 48.4717 10.6148 4.0662 12.4011 3.5214 0.8095 18.0868 26.5307 6.9065
temp: 298.150 k
press: 1.00000 atm
elementType: 16 7 7 7 7 6 6 6 6 6 6 6 6 6 6 6 6 6 6 6 1 1 1 1 1 1 1 1 1 1 1 1 1 1
symmnumber: 1
zpe: 680766.1 jmol-1
zpe.correction: 0.259290 hartree
zpe.thermalcorrener: 0.277200 hartree
zpe.thermalcorrenthalpy: 0.278144 hartree
zpe.thermalcorrgfe: 0.211321 hartree
zpe.sumelectzpe: -1195.600121 hartree
zpe.sumelectthermal: -1195.582211 hartree
zpe.sumelectthermalent: -1195.581266 hartree
zpe.sumelectthermalfe: -1195.648089 hartree
dipole: -9.9869 0.8717 0.0322
dipole: 10.0249
quadrupole: -99.6656 -109.7816 -130.1971
quadrupole: 14.3848 -0.1004 0.0416
quadrupole: 13.5492 3.4332 -16.9824 14.3848 -0.1004 0.0416
hfenergy: -1195.8594107 hartree
pointgroup: C01 [X(C15H14N4S1)]
dipole: 3.8469185 -0.4813176 -0.7249713 debye
polarizability: 633.0717002|-47.0235276|102.2808334|-41.9731113|37.0876007|196.3520365 unknown
InChI: InChI=1S/C15H14N4S/c1-19(2)14-7-5-12(6-8-14)17-18-13-4-3-11-10-16-20-15(11)9-13/h3-10H,1-2H3
charge 0 multiplicity 1
34 atoms
S  -5.350226 1.24849 2.363228
N  5.882582 -0.224126 -0.045648
N  0.239666 -0.022065 -0.585915
N  -0.483722 0.347631 0.452595
N  -6.702628 0.938479 1.160994
C  4.496253 -0.162657 -0.155543
C  -4.707751 0.422767 -0.080215
C  3.681765 0.239467 0.961686
C  3.831624 -0.498394 -1.382865
C  -4.082923 0.785625 1.156375
C  1.636345 -0.04099 -0.367428
C  -1.891622 0.352576 0.206789
C  2.290564 0.2979 0.856843
C  2.436158 -0.436414 -1.476526
C  -2.685903 0.754373 1.311496
C  -3.895111 0.021238 -1.180223
C  6.54508 0.127456 1.22024
C  6.697104 -0.640115 -1.1976
C  -2.505022 -0.013369 -1.039302
C  -6.148868 0.534354 0.008295
H  4.15139 0.504873 1.91293
H  4.408278 -0.806377 -2.258659
H  1.674468 0.602881 1.708483
H  1.926062 -0.693009 -2.411198
H  -2.18321 1.025278 2.24419
H  -4.36709 -0.257983 -2.128965
H  6.219445 -0.531563 2.049223
H  6.339306 1.176192 1.512476
H  7.634131 0.015026 1.105835
H  6.434901 -1.662772 -1.534029
H  7.760732 -0.638288 -0.914066
H  6.571054 0.047675 -2.057354
H  -1.851348 -0.316241 -1.861807
H  -6.838984 0.309284 -0.812134
