program: Gaussian 09
title: 000187278
version: EM64L-G09RevD.01
frameworkgroup: C1[X(C9H18N2O3)]
method: RPBEPBE
basis: SDD
operation: Freq
keyword: #p
keyword: freq=noraman
keyword: PBEPBE/SDD
title: #p freq=noraman PBEPBE/SDD
converged: YES YES NO NO
title: Mulliken charges:
elementType: O O O N N C C C C C C C C C H H H H H H H H H H H H H H H H H H
charge: -0.442613 -0.209525 -0.286530 -0.058405 0.041373 -0.402128 -0.372353 -0.409857 -0.346226 -0.033004 -0.491634 -0.703009 0.227634 -0.768571 0.238643 0.233705 0.211459 0.217759 0.211215 0.246498 0.238009 0.248334 0.188964 0.230804 0.241158 0.244747 0.210863 0.222575 0.335095 0.244286 0.232589 0.258147
chargesum: 0.00000
title: Mulliken charges with hydrogens summed into heavy atoms:
elementType: O O O N N C C C C C C C C C
charge: -0.107518 -0.209525 -0.286530 -0.058405 0.041373 0.070220 0.056865 0.047856 0.140116 0.155960 -0.019672 -0.024825 0.227634 -0.033548
polarizability: 1.41348412e+02 -7.29042342e+00 1.24842542e+02 8.62354373e-01 -2.26128300e+00 1.04647156e+02
1716.lowfreq: -22.5940 -10.1596 -3.1910 0.0002 0.0005 0.0007 22.9510 23.4209 26.5251
frequency: 21.8749 23.3393 26.1815 48.3938 60.6967 84.0669 95.1145 104.1140 115.8967 118.2002 176.2813 205.0384 244.2702 255.9155 296.7948 322.1375 341.2138 367.9278 383.0786 393.0353 423.7080 460.3451 472.7726 516.5627 585.4958 669.0596 725.5265 777.0085 792.7675 805.4951 843.7104 872.4679 913.7745 939.5318 946.2215 950.8591 999.6777 1039.7292 1051.1088 1064.6278 1070.4857 1078.9367 1099.7572 1139.6615 1171.1239 1181.6573 1224.5204 1233.8054 1251.7598 1258.4180 1274.1551 1285.4731 1303.8485 1325.5728 1337.8383 1344.7550 1351.5641 1362.7453 1366.6422 1370.7000 1377.8463 1399.6200 1430.7150 1438.1416 1442.9374 1452.6464 1456.3249 1460.0652 1469.3812 1475.2544 1479.4603 1637.8132 2932.6422 2951.2839 2976.8323 2980.1861 2985.9918 2988.8084 2991.4831 3011.5849 3023.1012 3038.6400 3052.1643 3064.6057 3065.6130 3088.3334 3089.5472 3100.7584 3121.3369 3553.5309
redmass: 6.4974 3.2593 3.3388 4.1465 4.3313 1.7254 3.4672 2.4559 1.7272 1.7997 2.9782 1.2148 3.2163 4.7567 5.9334 1.1057 3.3956 2.6394 3.1506 3.4740 3.0733 2.3669 2.5879 3.8249 4.0451 2.9161 1.2857 1.2472 4.1469 1.5407 2.4796 4.0155 2.3163 1.7556 1.6364 1.5753 2.1723 3.2810 3.3638 2.4383 2.9369 1.7515 1.8136 1.5212 2.1331 2.0244 1.4042 1.9136 1.4788 1.3787 1.2348 1.2731 1.3262 2.4404 1.3976 1.5555 1.3718 1.6891 1.4182 1.2469 1.2489 1.5087 1.0983 1.0909 1.0665 1.0829 1.0579 1.0495 1.0913 1.0855 1.0528 7.7961 1.0843 1.0634 1.0607 1.0382 1.0583 1.0570 1.0391 1.0940 1.0597 1.0996 1.1023 1.1031 1.0952 1.1000 1.1047 1.0994 1.1003 1.0661
irintensity: 3.1365 2.1167 3.0867 6.8338 2.9003 1.3565 0.4623 1.2726 2.2511 1.6442 0.4154 5.0808 1.9967 3.8668 5.8924 167.9932 4.4833 1.8196 5.7819 7.8764 7.9309 1.5869 10.1907 13.7651 2.7342 1.6409 11.2725 8.1116 2.8327 13.1853 7.7374 21.0640 33.8167 16.5285 7.8995 6.4990 113.0590 11.2995 17.7870 48.6948 2.6712 5.9058 15.0750 2.1502 61.6753 13.8272 93.7142 1.4856 15.4342 58.5577 2.5436 12.6142 42.7549 54.8858 49.5944 35.9977 10.9673 2.9350 2.9138 63.4146 12.2370 28.7193 6.8111 25.8451 21.7657 3.6906 16.8492 5.9751 12.1984 14.7825 13.2481 98.9973 54.2648 17.9438 3.4491 3.8408 35.1400 19.9649 37.7705 10.8296 14.8101 6.4381 2.9705 31.7248 11.9326 31.6701 27.9659 30.3727 13.4944 6.7319
temp: 298.150 k
press: 1.00000 atm
elementType: 8 8 8 7 7 6 6 6 6 6 6 6 6 6 1 1 1 1 1 1 1 1 1 1 1 1 1 1 1 1 1 1
symmnumber: 1
zpe: 700438.0 jmol-1
zpe.correction: 0.266783 hartree
zpe.thermalcorrener: 0.284323 hartree
zpe.thermalcorrenthalpy: 0.285268 hartree
zpe.thermalcorrgfe: 0.217849 hartree
zpe.sumelectzpe: -687.717737 hartree
zpe.sumelectthermal: -687.700197 hartree
zpe.sumelectthermalent: -687.699252 hartree
zpe.sumelectthermalfe: -687.766671 hartree
dipole: -0.5773 -0.7674 3.7051
dipole: 3.8275
quadrupole: -74.4077 -111.4692 -82.7919
quadrupole: 4.5773 -8.5724 3.3220
quadrupole: 15.1486 -21.9130 6.7644 4.5773 -8.5724 3.3220
hfenergy: -687.9845199 hartree
pointgroup: C01 [X(C9H18N2O3)]
dipole: -0.2081479 -0.8754217 1.2074304 debye
polarizability: 141.5048633|-6.7208232|122.9597199|-2.4905241|6.0533116|106.3735263 unknown
InChI: InChI=1S/C9H18N2O3/c1-8(12)4-3-6-11(10-14)7-5-9(2)13/h9,13H,3-7H2,1-2H3
charge 0 multiplicity 1
32 atoms
O  3.618035 -1.895848 -1.648575
O  -3.067889 -1.458334 -1.568987
O  -0.526003 3.144253 0.716563
N  0.706451 1.272347 0.900246
N  0.649975 2.625196 0.602617
C  2.040076 0.657237 0.786857
C  2.134815 -0.417701 -0.322031
C  -0.492453 0.524826 1.339675
C  -1.386783 0.060287 0.165244
C  3.588173 -0.891236 -0.565134
C  -2.690685 -0.577085 0.680002
C  4.229722 -1.589198 0.639665
C  -3.540956 -1.211834 -0.428397
C  -4.989424 -1.527681 -0.074593
H  2.737136 1.489206 0.575247
H  2.318862 0.217117 1.763837
H  1.728906 0.009173 -1.261823
H  1.521428 -1.303645 -0.06855
H  -0.149097 -0.338352 1.939415
H  -1.072122 1.207236 1.99167
H  -0.851468 -0.665544 -0.471108
H  -1.629347 0.929422 -0.47132
H  4.204894 -0.009832 -0.855178
H  -2.468712 -1.383561 1.413996
H  -3.30842 0.161322 1.229938
H  5.215328 -1.991024 0.350423
H  4.375046 -0.89126 1.483277
H  3.600036 -2.433045 0.974372
H  3.221358 -1.504073 -2.468301
H  -5.582657 -0.59229 -0.100552
H  -5.077318 -1.9379 0.947938
H  -5.418302 -2.232174 -0.804134
