program: Gaussian 09
title: 000184964
version: EM64L-G09RevD.01
frameworkgroup: C1[X(C14H16ClN3O2)]
method: RPBEPBE
basis: SDD
operation: Freq
keyword: #p
keyword: freq=noraman
keyword: PBEPBE/SDD
title: #p freq=noraman PBEPBE/SDD
converged: YES YES NO NO
title: Mulliken charges:
elementType: Cl O O N N N C C C C C C C C C C C C C C H H H H H H H H H H H H H H H H
charge: -0.055642 -0.260737 -0.166394 -0.135433 -0.066704 -0.110649 0.152005 0.168840 -0.193689 -0.698080 -0.691801 -0.683661 0.409954 -0.125800 -0.330994 -0.374645 -0.278352 -0.206997 -0.184021 -0.121928 0.269293 0.209026 0.225991 0.238217 0.228533 0.218444 0.237474 0.220489 0.235785 0.215978 0.307310 0.303438 0.261335 0.265524 0.258018 0.259874
chargesum: 0.00000
title: Mulliken charges with hydrogens summed into heavy atoms:
elementType: Cl O O N N N C C C C C C C C C C C C C C
charge: -0.055642 -0.260737 -0.166394 -0.135433 -0.066704 -0.110649 0.152005 0.168840 0.075604 -0.024846 -0.007351 -0.011409 0.409954 0.181510 -0.027556 -0.113310 -0.012829 0.051021 0.075853 -0.121928
polarizability: 2.30863010e+02 8.33270458e+00 1.72809796e+02 -1.29463575e+01 1.61282510e+01 1.48280326e+02
1716.lowfreq: -7.4889 -2.2661 -0.0027 -0.0022 -0.0022 4.6340 18.4806 31.7993 35.6917
frequency: 18.2100 31.7395 35.6627 54.2992 62.7430 80.3086 95.8713 103.6982 163.3015 165.6777 186.3467 206.8455 224.8450 226.3582 241.3523 256.7657 283.8067 316.2203 332.1351 334.6087 344.0286 362.3029 398.1802 416.3089 436.9941 499.0952 522.0361 570.7994 607.5415 623.8019 638.6329 663.2254 696.3139 721.7461 754.8948 793.5863 816.2294 819.2345 829.9220 830.4658 854.1466 887.8908 911.7421 926.1685 938.4064 943.0058 945.2990 950.8827 959.3208 964.0711 993.7947 1001.3623 1014.8283 1054.5460 1072.7903 1104.5665 1112.7402 1134.9126 1165.3802 1184.2577 1191.0346 1195.1221 1223.1291 1243.4936 1255.0776 1297.1254 1310.3016 1313.9066 1325.7197 1373.0262 1377.6665 1382.1039 1398.3054 1404.3458 1410.2180 1426.0968 1455.1410 1461.4621 1464.1445 1473.8697 1476.4393 1480.8238 1493.4562 1587.7229 1600.5863 1628.8319 2979.7171 2982.8447 2992.9253 3059.5738 3073.7943 3078.4074 3085.9540 3088.6134 3093.8475 3101.1610 3143.4979 3160.6129 3171.7963 3180.3854 3253.2024 3278.2282
redmass: 6.0630 3.7337 3.8353 4.0261 4.9750 7.1952 9.2387 6.4905 1.2879 3.4687 6.1374 2.9607 1.2643 2.0893 3.4103 1.5022 3.5106 5.9642 5.2367 5.2886 3.3214 2.4076 9.1033 3.0442 2.8768 2.9712 5.9073 4.0667 6.8809 6.7589 4.7978 3.2623 3.8719 6.6637 5.5197 5.5908 2.9465 1.3257 1.5112 1.4941 1.4045 4.2590 5.9295 1.8684 1.5930 6.1478 1.3521 1.2069 1.4990 3.7538 4.1139 1.7133 1.5326 1.8814 2.5231 2.6426 1.3416 4.4874 2.2455 1.3594 2.5858 1.8596 3.0601 2.8057 2.5861 1.3041 1.4692 4.5369 2.5352 6.4319 1.2010 1.2552 1.6146 3.0753 1.2877 3.5415 1.0497 1.0509 1.0479 2.1303 1.0688 1.0556 1.0720 6.7816 6.9048 10.1591 1.0344 1.0353 1.0360 1.0849 1.0998 1.0985 1.1011 1.1005 1.1000 1.0996 1.0912 1.0886 1.0955 1.0978 1.0982 1.1017
irintensity: 0.6289 0.3858 0.6286 0.1094 3.3474 0.4041 1.1510 0.5937 0.0621 0.0553 3.2758 1.3691 0.5810 0.8485 0.2119 0.3083 1.6469 1.1282 3.0381 1.2576 7.6389 0.6338 8.7065 0.1123 1.4498 19.0539 2.6955 4.6004 28.1637 5.0209 6.0879 36.2313 0.0457 10.1125 48.5726 18.7379 13.4139 3.1256 21.7720 97.0398 12.9024 33.7577 27.0238 7.3728 5.0652 157.1329 4.6800 0.6350 2.7127 12.8694 50.0739 45.1095 9.8183 62.8800 37.6418 26.5436 11.7778 20.1321 188.2326 16.1578 12.6463 68.9466 3.0018 42.4234 1.4548 0.9573 6.6812 34.2338 33.7812 3.5644 18.7943 15.5805 34.5199 5.0033 1.5439 41.4691 1.0687 8.7710 1.2660 180.4760 34.0844 19.2459 35.2980 12.6767 7.1805 101.8605 18.6985 21.4688 21.6436 25.1256 3.0636 56.8768 11.4849 12.9324 43.2485 25.4499 6.5761 2.4156 2.4383 2.0102 0.6615 6.5859
temp: 298.150 k
press: 1.00000 atm
elementType: 17 8 8 7 7 7 6 6 6 6 6 6 6 6 6 6 6 6 6 6 1 1 1 1 1 1 1 1 1 1 1 1 1 1 1 1
symmnumber: 1
zpe: 728884.4 jmol-1
zpe.correction: 0.277617 hartree
zpe.thermalcorrener: 0.297399 hartree
zpe.thermalcorrenthalpy: 0.298343 hartree
zpe.thermalcorrgfe: 0.227051 hartree
zpe.sumelectzpe: -1316.335228 hartree
zpe.sumelectthermal: -1316.315446 hartree
zpe.sumelectthermalent: -1316.314502 hartree
zpe.sumelectthermalfe: -1316.385794 hartree
dipole: 1.2496 -3.8242 2.1456
dipole: 4.5596
quadrupole: -136.1629 -128.7885 -123.3237
quadrupole: -9.5290 9.4841 6.5896
quadrupole: -6.7379 0.6366 6.1013 -9.5290 9.4841 6.5896
hfenergy: -1316.6128455 hartree
pointgroup: C01 [X(C14H16Cl1N3O2)]
dipole: -0.1056545 -1.5609104 -0.877732 debye
polarizability: 224.6254636|8.8513896|175.1750978|-20.3074609|-20.827105|152.1525708 unknown
InChI: InChI=1S/C14H16ClN3O2/c1-14(2,3)12(19)13(18-9-16-8-17-18)20-11-6-4-10(15)5-7-11/h4-9,13H,1-3H3
charge 0 multiplicity 1
36 atoms
Cl 5.60211 1.628087 -1.498461
O  0.328864 -0.320252 0.699257
O  -2.412382 -1.135029 1.637305
N  -1.527411 1.164832 0.17986
N  -1.648293 2.035346 -0.924884
N  -2.45129 3.025611 1.017224
C  -1.914199 -2.59753 -0.282889
C  -1.815889 -1.30655 0.547692
C  -0.933668 -0.151978 -0.025166
C  -2.573197 -3.708813 0.567747
C  -2.820854 -2.270268 -1.516067
C  -0.511619 -3.059439 -0.771674
C  1.520783 0.191054 0.113797
C  -2.009484 1.783201 1.320201
C  1.556587 1.063363 -0.999078
C  2.711453 -0.233691 0.747118
C  -2.216393 3.129119 -0.353996
C  2.810179 1.498116 -1.489356
C  3.958342 0.205847 0.259533
C  3.990126 1.06369 -0.859502
H  -0.783382 -0.248924 -1.113602
H  -2.7120 -4.616485 -0.04692
H  -1.944344 -3.968508 1.437524
H  -3.555388 -3.387286 0.95305
H  -2.905167 -3.175765 -2.143922
H  -2.406354 -1.46251 -2.1471
H  -3.836327 -1.975529 -1.196955
H  -0.627643 -3.987747 -1.36033
H  0.159981 -3.26847 0.078931
H  -0.016437 -2.315712 -1.421648
H  -2.027314 1.306743 2.294208
H  0.641487 1.439817 -1.467138
H  2.648513 -0.901428 1.611141
H  -2.460616 4.013761 -0.93602
H  2.856646 2.177145 -2.345464
H  4.886479 -0.116217 0.739788
