program: Gaussian 09
title: 000184959
version: EM64L-G09RevD.01
frameworkgroup: C1[X(C19H25NO10)]
method: RPBEPBE
basis: SDD
operation: Freq
keyword: #p
keyword: freq=noraman
keyword: PBEPBE/SDD
title: #p freq=noraman PBEPBE/SDD
converged: YES YES NO NO
title: Mulliken charges:
elementType: O O O O O O O O O O N C C C C C C C C C C C C C C C C C C C H H H H H H H H H H H H H H H H H H H H H H H H H
charge: -0.303544 -0.245484 -0.253068 -0.511498 -0.227881 -0.435695 -0.445194 -0.457251 -0.472488 -0.459427 0.007692 -0.022622 -0.138743 -0.199537 -0.188255 0.023911 -0.360983 -0.007095 -0.200536 -0.125669 -0.062281 -0.352752 -0.189395 0.454458 -0.123445 -0.388673 -0.368397 -0.227044 -0.224421 -0.226571 0.239238 0.242965 0.288058 0.293564 0.207228 0.242538 0.228029 0.218573 0.259028 0.204273 0.224963 0.242671 0.203372 0.370515 0.370500 0.372145 0.252116 0.347854 0.364950 0.362351 0.241877 0.243882 0.236589 0.236885 0.237722
chargesum: 0.00000
title: Mulliken charges with hydrogens summed into heavy atoms:
elementType: O O O O O O O O O O N C C C C C C C C C C C C C C C C C C C
charge: -0.303544 -0.245484 -0.253068 -0.140983 -0.227881 -0.065195 -0.073048 -0.109397 -0.107538 -0.097077 0.007692 0.216616 0.104222 0.088521 0.105309 0.231139 0.109585 0.211479 0.058491 0.078604 0.162682 0.093291 0.062722 0.454458 -0.123445 -0.146796 -0.124515 0.009544 0.012465 0.011151
polarizability: 2.77658591e+02 4.77011645e+00 2.64407739e+02 1.87445432e+00 2.05266691e+01 1.83910879e+02
1716.lowfreq: -3.5227 0.0006 0.0007 0.0009 2.2379 5.0938 10.9147 16.5947 23.1943
frequency: 10.2144 16.2101 22.9797 37.1712 44.4926 52.4849 60.8197 79.6312 86.6291 94.8732 127.8138 140.9711 162.2656 166.8838 175.4683 191.2027 203.0157 208.6292 216.5506 224.5798 229.0225 236.2259 247.2632 256.7903 269.9551 295.2074 304.6672 329.7396 347.7190 366.7794 380.5089 393.4693 400.9834 401.2253 417.1868 431.6432 435.7633 442.1565 465.8100 475.1206 482.5420 505.0746 520.2520 526.9367 529.9091 543.7169 555.1522 574.8306 583.6186 593.6217 603.3509 608.1246 615.6496 646.1318 700.7098 747.6304 758.2857 783.7008 822.1284 834.0512 848.5251 853.7715 874.2102 883.5448 894.5291 897.4797 910.8457 931.0613 951.8119 958.8603 962.1102 969.2529 978.7308 981.0387 992.1825 993.0366 998.9356 1004.0429 1011.3103 1019.7949 1023.0542 1029.0115 1033.5675 1047.3458 1063.9585 1069.6031 1089.4263 1089.7046 1102.1060 1105.3287 1115.5040 1125.8845 1162.0613 1172.0880 1177.4361 1194.7424 1198.6801 1209.6991 1217.9847 1225.2406 1238.6783 1241.2630 1245.3530 1252.0187 1258.0295 1264.9739 1277.7096 1280.2813 1289.7293 1305.5826 1306.5793 1308.5183 1317.6834 1329.0799 1335.6945 1343.4846 1349.5653 1357.0380 1362.0842 1371.4071 1374.0335 1383.6877 1384.8617 1389.1369 1393.1886 1407.1116 1421.6062 1443.8397 1456.3243 1469.1707 1485.9401 1598.0517 1614.7503 2220.9126 2921.7846 2932.6830 2942.0019 2960.3993 2965.2471 2977.6479 2987.5606 3008.1404 3018.8912 3066.5050 3074.9855 3076.6110 3087.6255 3109.0193 3129.9887 3132.5101 3142.9665 3156.7125 3171.2692 3314.4422 3434.1716 3481.8055 3504.8930 3549.3201 3598.2992
redmass: 4.4150 5.0583 6.4814 6.6160 6.0968 5.9990 6.4985 7.9849 7.3332 7.3448 7.5472 6.5889 6.7509 5.4449 6.4352 4.7704 5.1102 4.4956 1.4044 3.6353 4.2522 5.1304 4.3490 5.4915 5.0390 6.6504 3.6520 5.8080 4.0219 5.5645 6.6629 4.9227 3.3987 3.6752 1.5119 3.8156 4.9779 3.4744 3.5753 5.5487 1.6846 2.1947 3.9993 4.4252 4.6800 3.6966 1.8620 1.2745 1.5831 3.0429 5.9398 4.8183 6.4146 5.8464 1.8034 1.0790 2.0628 3.6388 3.7040 3.9654 3.0344 1.2499 4.3026 5.4438 2.4414 6.6733 5.5769 1.6576 3.6605 6.9161 3.6459 3.6675 6.4015 1.4044 5.0843 4.5902 5.9353 1.3403 5.3774 2.8453 4.0363 2.2127 3.8722 3.3254 2.7183 3.1227 2.9918 1.6302 3.4593 2.1954 2.5476 3.1486 1.1909 1.2227 1.0555 1.1118 1.7162 1.3344 1.2058 1.1887 1.2245 1.3420 1.2805 1.2069 1.2403 1.4525 1.2625 1.1544 1.5122 1.2039 1.3665 1.1954 1.2470 1.2442 1.2879 1.3205 1.3352 1.2971 1.2998 1.3315 1.4137 1.2797 1.7344 7.7548 1.5321 1.1963 1.1553 2.1948 1.0805 1.0881 2.2908 6.1534 6.0131 12.6105 1.0820 1.0850 1.0832 1.0818 1.0700 1.0847 1.0827 1.0629 1.0819 1.0853 1.0863 1.1062 1.0881 1.0970 1.0866 1.0884 1.0920 1.0963 1.1016 1.0686 1.0655 1.0649 1.0649 1.0656 1.0672
irintensity: 0.1541 0.0301 0.9990 0.1616 1.5250 0.4697 2.1879 0.7037 4.3997 1.1710 0.7416 1.9358 5.1978 3.6204 8.6584 17.2282 5.8892 10.9359 129.8347 11.9823 5.1760 0.9843 22.5844 7.7274 25.9047 14.9500 3.6296 0.4233 9.5539 5.0787 2.4595 10.0033 1.3361 1.9981 147.5288 2.3634 15.3674 40.4913 10.3621 4.9658 72.9588 26.8465 4.5337 28.4112 7.6980 9.5274 45.7062 103.6960 116.2822 8.9285 5.2735 8.8189 0.3689 15.3949 49.0856 132.6101 78.5949 1.2077 9.4655 25.9294 14.3061 0.2617 81.5772 41.0630 51.0643 192.0069 44.2056 9.3553 13.2780 222.3431 96.1763 86.2749 129.9396 0.0634 30.3150 37.5030 153.3372 0.3344 51.5532 61.9311 53.9606 1.0966 7.1682 126.4803 15.5175 21.5095 11.4214 7.2890 10.5080 9.0057 61.1676 50.3234 11.5978 18.7212 0.0398 2.1916 15.3781 23.5725 16.4397 4.7807 9.2003 38.2160 5.8942 12.9048 3.6009 53.4052 11.1741 39.6265 4.5765 18.3053 6.4177 12.8896 7.5148 29.5523 2.3683 19.1103 5.7766 12.6424 2.5987 23.1570 0.2344 3.5051 26.2383 0.8714 11.3195 72.6935 36.8478 15.0405 9.8646 8.6120 6.7767 0.5971 0.6066 7.9150 26.8414 28.6595 54.0861 12.3980 21.5254 21.3227 77.8741 14.4496 46.1649 40.1540 8.8823 13.5518 19.6985 23.7171 2.8698 0.8605 10.8085 23.4095 18.8838 681.6180 79.6660 28.9562 21.9805 16.6035 17.7150
temp: 298.150 k
press: 1.00000 atm
elementType: 8 8 8 8 8 8 8 8 8 8 7 6 6 6 6 6 6 6 6 6 6 6 6 6 6 6 6 6 6 6 1 1 1 1 1 1 1 1 1 1 1 1 1 1 1 1 1 1 1 1 1 1 1 1 1
symmnumber: 1
zpe: 1131523.1 jmol-1
zpe.correction: 0.430974 hartree
zpe.thermalcorrener: 0.460122 hartree
zpe.thermalcorrenthalpy: 0.461066 hartree
zpe.thermalcorrgfe: 0.369183 hartree
zpe.sumelectzpe: -1543.605571 hartree
zpe.sumelectthermal: -1543.576424 hartree
zpe.sumelectthermalent: -1543.575480 hartree
zpe.sumelectthermalfe: -1543.667362 hartree
dipole: 5.3345 -0.6949 -2.7024
dipole: 6.0202
quadrupole: -191.5725 -149.7288 -186.9209
quadrupole: 18.6233 -8.4502 14.5096
quadrupole: -15.4985 26.3453 -10.8468 18.6233 -8.4502 14.5096
hfenergy: -1544.0365456 hartree
pointgroup: C01 [X(C19H25N1O10)]
dipole: 1.9599958 -0.2131788 -1.3125764 debye
polarizability: 278.1330206|6.4593095|254.5194634|-4.4636716|32.3133314|193.3247259 unknown
InChI: InChI=1S/C19H25NO10/c20-6-11(9-4-2-1-3-5-9)29-19-17(26)15(24)14(23)12(30-19)8-28-18-16(25)13(22)10(21)7-27-18/h1-5,10-19,21-26H,7-8H2
charge 0 multiplicity 1
55 atoms
O  0.081944 -1.475921 -0.270554
O  -2.889083 -1.534719 -0.906775
O  -3.65307 -0.897093 1.215708
O  0.945871 -4.213271 -2.060654
O  2.094964 -0.253972 -0.08613
O  0.557285 -3.516719 1.569752
O  3.273432 -3.162069 -1.00849
O  -3.25209 1.274242 -1.886947
O  -4.907952 2.853169 -0.186497
O  -4.750231 2.353515 2.672576
N  -0.492468 1.661848 -1.401818
C  -0.627834 -2.572773 -0.992832
C  0.165804 -3.909289 -0.834652
C  1.221406 -3.779516 0.292525
C  2.259515 -2.679998 -0.07325
C  1.521623 -1.443773 -0.657226
C  -2.055547 -2.651006 -0.438672
C  -2.961346 -0.418107 -0.010016
C  -3.808195 0.691943 -0.666483
C  -4.029671 1.820288 0.366401
C  -4.675328 1.30221 1.654959
C  -3.805111 0.169177 2.225825
C  2.041466 0.962042 -0.951726
C  2.895313 2.033416 -0.293473
C  0.640923 1.384267 -1.187446
C  4.297699 1.983797 -0.486811
C  2.333292 3.035017 0.533295
C  5.132731 2.930455 0.142946
C  3.170069 3.984004 1.160375
C  4.569497 3.933794 0.966481
H  -0.673594 -2.303989 -2.069384
H  -0.516658 -4.747936 -0.598144
H  1.749644 -4.737064 0.422894
H  2.798738 -2.379054 0.839944
H  1.586688 -1.443502 -1.769892
H  -2.061113 -2.711807 0.66523
H  -2.542376 -3.557343 -0.841872
H  -1.947579 -0.058272 0.280071
H  -4.775233 0.251405 -0.965702
H  -3.03988 2.26726 0.621407
H  -5.686877 0.916091 1.409042
H  -4.287207 -0.308381 3.09183
H  -2.81687 0.573302 2.532721
H  0.369953 -4.608003 -2.759272
H  0.231176 -2.575764 1.541383
H  2.787376 -3.679316 -1.711166
H  2.47028 0.690726 -1.940953
H  -2.280864 1.490468 -1.754122
H  -4.62305 2.988448 -1.130092
H  -5.17571 3.140938 2.244174
H  4.734525 1.19893 -1.11556
H  1.248967 3.077087 0.688158
H  6.216531 2.88694 -0.007093
H  2.731829 4.758624 1.79836
H  5.217198 4.671155 1.453048
