program: Gaussian 09
title: 000184954
version: EM64L-G09RevD.01
frameworkgroup: C1[X(C17H22N2O2)]
method: RPBEPBE
basis: SDD
operation: Freq
keyword: #p
keyword: freq=noraman
keyword: PBEPBE/SDD
title: #p freq=noraman PBEPBE/SDD
converged: YES YES NO NO
title: Mulliken charges:
elementType: O O N N C C C C C C C C C C C C C C C C C H H H H H H H H H H H H H H H H H H H H H H
charge: -0.224279 -0.290229 -0.209204 -0.082926 0.294334 -0.171408 -0.630834 -0.741734 -0.721585 -0.739477 0.233443 0.402068 0.160782 -0.403989 -0.150719 -0.172479 -0.368552 -0.252134 -0.234972 -0.334228 -0.539043 0.250662 0.255160 0.228924 0.204133 0.260010 0.223653 0.214627 0.220606 0.207855 0.236758 0.218392 0.218132 0.250443 0.263405 0.288349 0.236727 0.228759 0.225916 0.255570 0.242283 0.227062 0.219738
chargesum: 0.00000
title: Mulliken charges with hydrogens summed into heavy atoms:
elementType: O O N N C C C C C C C C C C C C C C C C C
charge: -0.224279 -0.290229 -0.209204 -0.082926 0.294334 0.079254 -0.146749 -0.053937 -0.078496 -0.066195 0.233443 0.402068 0.160782 -0.153546 0.112686 0.115870 -0.131824 -0.023375 -0.009056 -0.078658 0.150039
polarizability: 1.87786538e+02 -1.53067455e+01 2.03481467e+02 -9.80058014e+00 -7.13932592e+00 1.93492770e+02
1716.lowfreq: -16.3816 -12.0925 -4.4497 -0.0007 -0.0005 -0.0003 15.8360 22.7129 31.0879
frequency: 15.2406 22.6204 30.6730 47.4162 54.0129 71.0969 96.3539 133.0441 140.4515 162.3431 178.5822 198.0521 208.4838 228.3528 241.9654 246.8665 260.8016 274.4935 287.9029 292.3728 320.1154 339.3627 376.7964 391.0074 414.7213 461.0583 473.5884 488.0566 512.8684 530.8209 556.7773 595.1113 597.4886 640.4831 682.5148 720.8725 723.8843 730.8117 737.9059 759.0601 788.8587 818.9017 828.3778 853.3704 857.2753 868.8701 891.3443 914.7196 931.3173 932.9724 941.1754 946.4569 974.9816 981.5114 986.7106 1005.4454 1012.4923 1028.4165 1041.5095 1050.0774 1080.2556 1104.2243 1108.6492 1111.8727 1148.9145 1170.2393 1174.3856 1182.0543 1193.9182 1203.6388 1219.2390 1223.2776 1228.0781 1234.6226 1251.4268 1285.7085 1292.4241 1322.3697 1326.5114 1367.5589 1382.1316 1383.2842 1388.9927 1407.5316 1429.4218 1438.7916 1443.2006 1454.0210 1460.2406 1466.1600 1467.5888 1470.9037 1472.8161 1481.6068 1486.8396 1487.9730 1489.5560 1497.1675 1594.9061 1607.1538 1615.7243 2960.9542 2969.6348 2973.5726 2980.2382 3018.9740 3049.2547 3052.9725 3062.8490 3067.0983 3069.0195 3071.3892 3078.2470 3086.1774 3087.4282 3121.6139 3127.7561 3136.2130 3155.2451 3168.6312 3230.9061 3260.2055 3270.2543
redmass: 4.7043 5.5442 4.2358 3.4768 3.0385 4.3460 3.2987 4.8744 4.3208 4.4460 4.6050 1.1500 2.6187 2.7699 1.4589 1.4226 1.3517 1.8122 2.3266 2.7890 3.7543 2.3567 2.9058 2.5939 2.7960 3.0838 3.1439 3.6367 5.5190 4.2200 3.9312 4.3843 3.5279 3.7120 4.6538 1.3505 3.4819 2.8738 3.9495 1.4245 3.9765 1.4504 3.3400 1.5284 1.4360 5.9067 3.3735 2.5993 1.6782 1.6423 1.4614 1.2074 1.9943 1.6163 7.7823 2.5380 1.8108 1.4809 1.9558 2.2512 3.5837 2.1516 1.4447 1.2618 1.4337 1.2179 1.3305 1.5630 2.1427 1.8161 2.3821 2.5799 2.8190 4.7929 1.7459 1.3961 1.5985 1.5172 1.9607 2.2138 1.2615 1.2170 4.5041 1.2105 1.4485 3.8382 1.4942 1.1570 1.0618 1.0510 1.1306 1.1472 1.0783 1.0878 1.3679 2.5311 1.6479 1.0571 6.7632 6.5764 9.1345 1.0327 1.0354 1.0356 1.0360 1.0589 1.1038 1.0841 1.0999 1.0994 1.0996 1.0984 1.0982 1.1018 1.0997 1.0997 1.0861 1.0900 1.0932 1.1000 1.0931 1.0976 1.1079
irintensity: 0.2779 0.3330 2.0621 0.6485 0.0884 0.7638 6.2988 0.9134 1.2172 1.8484 3.2302 0.6990 0.0285 0.5942 0.7954 1.1292 1.1128 2.9515 0.8868 0.1556 3.3212 2.0789 0.9816 0.3867 0.3870 4.7823 5.6608 6.1596 4.9314 7.1165 2.8156 2.5959 3.6786 13.2671 7.4896 47.9222 2.3391 10.2336 7.5181 89.7297 4.6483 40.2748 3.0924 2.7932 0.9531 7.0075 12.2059 25.8753 5.8029 2.2616 15.5923 0.2251 12.5931 2.1953 42.8543 13.2091 10.4181 0.8775 14.3604 9.3552 3.7763 38.0445 66.1909 0.3383 0.2174 16.5872 11.8499 122.2418 65.7844 91.7235 15.2702 64.0738 36.8705 16.8846 142.9277 6.8630 14.7235 2.6833 6.3957 112.9635 16.6608 21.0899 18.0348 18.8527 12.3968 63.4328 8.2900 4.3567 3.7925 12.8339 10.3668 49.3027 13.6734 9.5456 13.8692 15.8761 24.7616 29.8436 7.0912 13.7248 109.3867 65.0937 28.9438 26.0669 26.8890 16.9687 41.2762 5.0128 2.5961 18.7841 17.7015 75.7456 75.0389 6.5971 25.3761 20.9810 1.2045 10.0431 22.1650 18.6574 3.3097 1.5214 3.3345
temp: 298.150 k
press: 1.00000 atm
elementType: 8 8 7 7 6 6 6 6 6 6 6 6 6 6 6 6 6 6 6 6 6 1 1 1 1 1 1 1 1 1 1 1 1 1 1 1 1 1 1 1 1 1 1
symmnumber: 1
zpe: 933405.6 jmol-1
zpe.correction: 0.355515 hartree
zpe.thermalcorrener: 0.376763 hartree
zpe.thermalcorrenthalpy: 0.377707 hartree
zpe.thermalcorrgfe: 0.303616 hartree
zpe.sumelectzpe: -919.371551 hartree
zpe.sumelectthermal: -919.350304 hartree
zpe.sumelectthermalent: -919.349360 hartree
zpe.sumelectthermalfe: -919.423451 hartree
dipole: -3.0162 -3.9712 3.0882
dipole: 5.8656
quadrupole: -121.7983 -137.6138 -118.5493
quadrupole: -10.4003 -5.7971 -5.2044
quadrupole: 4.1888 -11.6267 7.4378 -10.4003 -5.7971 -5.2044
hfenergy: -919.7270669 hartree
pointgroup: C01 [X(C17H22N2O2)]
dipole: -1.5830471 -1.3961365 0.9328567 debye
polarizability: 184.9103446|-9.4472738|209.7082673|-12.8138833|-4.4861254|190.1421629 unknown
InChI: InChI=1S/C17H22N2O2/c1-17(2,3)14(16(20)19-10-9-18-12-19)11-13-7-5-6-8-15(13)21-4/h5-10,12,14H,11H2,1-4H3
charge 0 multiplicity 1
43 atoms
O  1.948317 0.261102 -1.731263
O  -2.344448 -1.259408 0.883158
N  1.73519 1.041576 0.442738
N  2.64452 2.915513 1.364253
C  1.540173 -2.457455 -0.124891
C  0.633363 -1.154658 -0.220084
C  -0.534824 -1.269987 -1.251455
C  1.992165 -2.949003 -1.524093
C  0.719601 -3.570974 0.5825
C  2.794719 -2.152358 0.740816
C  1.471667 0.068999 -0.582809
C  -1.561333 -0.159824 -1.096174
C  -2.483283 -0.171354 -0.007336
C  -1.63812 0.911885 -2.014295
C  1.262794 1.112267 1.777023
C  2.567343 2.169945 0.257601
C  -3.454792 0.844849 0.142745
C  -2.59968 1.940864 -1.874794
C  -3.507819 1.901273 -0.796487
C  1.825425 2.25849 2.317587
C  -3.332341 -1.388504 1.957043
H  0.179325 -1.024219 0.776664
H  -0.112289 -1.244568 -2.270168
H  -1.025949 -2.247168 -1.100808
H  2.67974 -3.808392 -1.412501
H  2.515997 -2.15264 -2.080644
H  1.133129 -3.284265 -2.132662
H  1.328693 -4.490795 0.662603
H  -0.20163 -3.827473 0.029947
H  0.427074 -3.264668 1.604607
H  3.474245 -1.437038 0.241998
H  2.519331 -1.732434 1.726918
H  3.36524 -3.082793 0.91762
H  -0.929854 0.934055 -2.850991
H  0.57791 0.385196 2.199455
H  3.061374 2.360114 -0.690511
H  -4.165677 0.829373 0.974491
H  -2.63717 2.759602 -2.600605
H  -4.259368 2.689662 -0.677655
H  1.70128 2.663109 3.319343
H  -3.062466 -2.31383 2.487524
H  -4.358056 -1.477045 1.550168
H  -3.285619 -0.530922 2.656427
