program: Gaussian 09
title: 000187266
version: EM64L-G09RevD.01
frameworkgroup: C1[X(C20H17FO2)]
method: RPBEPBE
basis: SDD
operation: Freq
keyword: #p
keyword: freq=noraman
keyword: PBEPBE/SDD
title: #p freq=noraman PBEPBE/SDD
converged: YES YES NO NO
title: Mulliken charges:
elementType: F O O C C C C C C C C C C C C C C C C C C C C H H H H H H H H H H H H H H H H H
charge: -0.201135 -0.471654 -0.441289 0.133830 -0.195781 0.165380 0.148356 0.149628 0.023411 0.083861 -0.206927 0.140577 -0.353526 -0.332897 -0.911352 0.174412 0.461102 -0.786130 -0.681088 -0.344049 -0.453949 -0.267472 -0.253482 0.204101 0.279757 0.230381 0.251331 0.254196 0.209669 0.341450 0.255943 0.213661 0.242145 0.260772 0.262227 0.372135 0.246323 0.334987 0.229010 0.232086
chargesum: 0.00000
title: Mulliken charges with hydrogens summed into heavy atoms:
elementType: F O O C C C C C C C C C C C C C C C C C C C C
charge: -0.201135 -0.099519 -0.106302 0.133830 0.008320 0.165380 0.148356 0.149628 0.023411 0.083861 0.072830 0.140577 -0.123145 -0.081566 -0.106037 0.174412 0.461102 -0.074381 -0.420316 -0.081822 -0.207626 -0.038462 -0.021395
polarizability: 3.93844398e+02 2.39316390e+01 2.47647735e+02 -9.36672418e+00 7.85074003e+00 1.15769107e+02
1716.lowfreq: -6.7820 -0.0005 0.0004 0.0008 1.4843 5.9039 20.3802 24.2438 50.4247
frequency: 19.4923 23.9944 50.3943 63.8136 89.8564 125.9816 160.9907 178.7479 197.9872 231.7714 256.9281 262.9203 291.1791 296.0150 303.3003 310.7189 326.7591 359.6445 368.0193 383.1014 386.0865 411.1329 416.5007 445.1389 468.4994 477.3574 487.1435 521.9228 525.3477 540.7095 552.2631 571.0676 577.7832 616.4972 628.7128 635.7813 644.2972 679.0602 720.7843 753.5295 763.7916 780.6157 795.0580 805.8482 836.4094 854.3499 871.9688 894.5779 912.9500 934.8532 960.8525 963.1181 975.8980 989.3086 1017.5189 1032.1383 1034.2731 1040.2662 1046.2498 1054.0727 1066.9361 1093.9690 1114.9442 1133.0515 1155.0900 1171.9831 1180.1325 1192.8063 1212.9954 1235.0568 1247.8720 1257.8675 1277.8497 1300.6896 1316.9126 1330.1877 1350.4193 1357.3242 1364.1837 1383.2708 1393.1213 1401.6810 1409.1047 1413.2297 1421.5071 1440.9046 1466.0360 1474.3262 1485.5025 1494.6414 1503.6826 1514.5381 1558.1122 1562.5733 1616.0564 1628.8048 1644.8532 2867.3193 2967.7871 3006.7506 3013.7970 3073.0583 3085.6945 3119.5528 3124.7017 3125.4802 3136.2974 3137.7086 3160.4884 3164.9364 3165.4904 3212.4671 3483.7898 3533.6221
redmass: 3.8519 4.5359 3.6008 4.7012 3.8491 4.8822 4.3230 1.1968 5.0419 4.8402 4.8822 5.3598 4.4338 1.7507 4.5832 2.4221 5.6358 1.5761 2.2392 3.7946 3.7335 7.0782 3.0579 5.0900 4.8898 3.4065 3.6935 3.3825 1.2725 3.2365 4.3420 4.6972 4.5750 5.2843 3.7362 4.0533 5.0131 3.6076 3.2424 3.8559 1.4161 3.3303 2.6759 4.3900 5.2680 1.3953 4.3017 1.6425 4.0178 4.2539 1.4293 1.3568 3.0328 1.3750 4.3150 2.5126 2.0247 1.5714 2.2596 1.9363 1.7348 2.7090 2.0804 2.9070 1.7610 1.3014 1.1352 1.2177 1.7793 1.2295 1.3277 1.9988 3.3258 2.3811 1.5820 3.4538 2.3291 1.9580 1.4208 3.8347 4.6488 2.4430 1.3353 1.2166 2.5870 2.7411 1.2432 1.6647 1.4411 1.2875 1.5314 1.8862 7.0355 4.9104 6.2249 8.0233 7.9440 1.0804 1.0489 1.0410 1.0831 1.0846 1.0944 1.0975 1.0983 1.0864 1.0863 1.0910 1.0989 1.0931 1.0969 1.0919 1.0650 1.0658
irintensity: 1.2762 1.4860 0.7328 1.0048 0.2085 1.1517 2.9288 0.6926 3.2598 0.2892 2.9580 0.1609 2.6676 0.2220 2.3398 1.3824 0.1131 43.2826 18.1133 3.4224 4.0203 3.8166 12.0412 4.4764 0.7496 0.8837 2.3766 13.8147 162.6972 5.5155 3.5424 3.2564 10.2418 6.4223 5.1001 2.2541 11.7862 13.3286 19.1433 7.2284 44.3066 6.0034 35.4156 20.0595 7.5705 21.4720 10.0320 24.8862 154.4465 15.0040 5.0567 7.1086 53.9689 2.8788 47.2303 14.4316 12.3717 5.0012 2.6050 13.1184 2.2011 18.4007 10.7112 24.0446 21.5877 9.6433 1.3722 4.1792 7.6390 19.6746 49.2822 9.7744 6.1089 33.8057 1.3572 13.3634 9.6511 3.8293 76.6542 21.2546 16.0409 12.7523 21.8184 8.6797 1.8614 15.2725 7.0036 11.8393 8.3935 21.6252 20.3194 8.9984 2.5673 15.5886 0.2838 38.6487 12.7087 51.1769 30.1141 19.5470 11.9393 22.5875 14.1027 19.1127 8.1438 2.5246 1.2423 15.3556 42.1262 3.4883 31.2947 9.3679 25.9907 6.0336
temp: 298.150 k
press: 1.00000 atm
elementType: 9 8 8 6 6 6 6 6 6 6 6 6 6 6 6 6 6 6 6 6 6 6 6 1 1 1 1 1 1 1 1 1 1 1 1 1 1 1 1 1
symmnumber: 1
zpe: 822292.1 jmol-1
zpe.correction: 0.313195 hartree
zpe.thermalcorrener: 0.332605 hartree
zpe.thermalcorrenthalpy: 0.333549 hartree
zpe.thermalcorrgfe: 0.265073 hartree
zpe.sumelectzpe: -1020.991600 hartree
zpe.sumelectthermal: -1020.972190 hartree
zpe.sumelectthermalent: -1020.971246 hartree
zpe.sumelectthermalfe: -1021.039722 hartree
dipole: 0.4655 -0.6342 -2.7000
dipole: 2.8123
quadrupole: -118.6185 -129.0535 -136.4010
quadrupole: 4.7955 -9.3582 3.6533
quadrupole: 9.4058 -1.0292 -8.3767 4.7955 -9.3582 3.6533
hfenergy: -1021.3047948 hartree
pointgroup: C01 [X(C20H17F1O2)]
dipole: -0.156886 -0.2161832 1.0737162 debye
polarizability: 396.416958|-13.5159774|243.9725164|-10.1755637|-13.946897|116.871765 unknown
InChI: InChI=1S/C20H17FO2/c1-10-13-7-8-16(22)20(23)18(13)11(2)17-14-6-4-3-5-12(14)9-15(21)19(10)17/h3-9,16,20,22-23H,1-2H3
charge 0 multiplicity 1
40 atoms
F  1.375462 3.442522 -0.924981
O  -2.833577 -2.546776 -1.05222
O  -5.336535 -1.702767 -0.027041
C  -1.65014 -0.573682 -0.029869
C  -2.891429 -1.48421 -0.028947
C  -1.871159 0.835077 0.221167
C  -0.33261 -1.088822 -0.10327
C  0.791537 -0.171169 -0.068573
C  0.512113 1.248891 -0.18629
C  -0.806807 1.760466 0.070664
C  -4.228766 -0.748984 -0.283052
C  2.200592 -0.598844 0.048314
C  -3.210249 1.282228 0.658801
C  -4.3357 0.535748 0.483504
C  -0.116813 -2.587059 -0.282701
C  1.625188 2.092725 -0.571839
C  3.255974 0.321142 -0.316152
C  -1.044773 3.260844 0.188281
C  2.922561 1.667182 -0.69644
C  2.61763 -1.855584 0.598439
C  4.626235 -0.077658 -0.25745
C  3.969936 -2.218377 0.686904
C  4.987637 -1.340256 0.223718
H  -2.963191 -1.95929 0.982272
H  -4.314549 -0.566941 -1.371753
H  -3.29732 2.253477 1.153024
H  -5.327496 0.885991 0.790791
H  0.817873 -2.799189 -0.823984
H  -0.073338 -3.117345 0.690201
H  -0.955754 -3.019176 -0.842635
H  -1.055159 3.741741 -0.806204
H  -2.005313 3.492539 0.669789
H  -0.248089 3.754154 0.767569
H  3.696817 2.360182 -1.038423
H  1.87779 -2.538631 1.012723
H  -3.746284 -2.944952 -1.068961
H  5.394989 0.639309 -0.568194
H  -5.417858 -1.832073 0.953948
H  4.240302 -3.183611 1.128812
H  6.040673 -1.636723 0.274959
