program: Gaussian 09
title: 000187252
version: EM64L-G09RevD.01
frameworkgroup: C1[X(C18H14O2)]
method: RPBEPBE
basis: SDD
operation: Freq
keyword: #pfreq=noraman
keyword: PBEPBE/SDD
title: #p freq=noraman PBEPBE/SDD
converged: YES YES NO NO
title: Mulliken charges:
elementType: O O C C C C C C C C C C C C C C C C C C H H H H H H H H H H H H H H
charge: -0.455586 -0.438851 0.258697 -0.234480 0.091523 0.271977 -0.180740 0.281619 -0.435648 0.157230 -0.298688 -0.320548 -0.421033 -0.441690 0.435180 -0.509496 -0.347106 -0.439486 -0.259578 -0.251668 0.208787 0.275209 0.284293 0.219370 0.248499 0.226515 0.220761 0.234632 0.222289 0.364335 0.241859 0.333557 0.228229 0.230039
chargesum: 0.00000
title: Mulliken charges with hydrogens summed into heavy atoms:
elementType: O O C C C C C C C C C C C C C C C C C C
charge: -0.091251 -0.105294 0.258697 -0.025694 0.091523 0.271977 0.094469 0.281619 -0.151355 0.157230 -0.079318 -0.072050 -0.194518 -0.220930 0.435180 -0.274864 -0.124817 -0.197627 -0.031349 -0.021628
polarizability: 3.71722682e+02 1.11428007e+01 2.05054384e+02 -3.06089247e+00 -1.50370641e+00 8.81159318e+01
1716.lowfreq: -5.3330 -2.2698 -0.0008 -0.0006 0.0003 9.5525 43.9858 59.8928 89.6690
frequency: 43.9759 59.8901 89.6659 117.0260 144.7265 186.6836 222.2334 250.6248 262.9733 265.6675 286.9823 333.7951 359.9574 394.0553 409.2371 448.3945 453.4008 467.5050 478.9522 498.8624 515.8764 521.9463 533.4627 537.2338 574.5118 588.2808 623.4749 651.2077 703.1361 713.4469 754.6676 772.0768 785.7621 788.5161 808.9650 842.6804 856.6756 859.5317 867.4037 888.0155 917.8872 937.8427 954.8059 967.4191 978.8860 983.8992 992.4317 1026.1132 1034.1787 1047.2656 1071.7806 1091.4561 1135.4122 1157.1801 1174.1965 1181.2840 1188.9991 1196.1221 1217.2488 1235.9460 1246.1374 1248.6832 1262.3494 1270.5468 1306.5767 1329.1024 1352.9367 1354.9068 1379.6033 1384.0469 1401.6836 1407.7260 1422.3505 1448.0496 1458.7459 1501.0460 1538.3136 1577.8836 1589.4249 1615.2252 1626.2725 1631.1435 2848.2095 3013.7028 3121.7406 3124.3364 3130.3009 3133.6043 3147.3153 3155.3165 3155.6657 3166.2828 3167.1208 3177.0191 3524.5030 3527.9489
redmass: 5.7755 4.4597 5.4855 3.8682 5.7764 4.6682 3.9345 5.2632 4.6099 4.8301 4.8230 4.0051 1.1948 3.1548 4.5909 4.2053 2.7131 5.5145 1.5356 2.5327 4.6905 5.3639 3.1744 4.2047 6.2022 3.0825 4.0955 4.9479 3.6305 2.5716 1.3844 2.3449 3.0784 3.2998 1.9192 1.8317 3.9773 2.8131 3.4694 2.0236 3.4410 3.8635 1.4029 1.3370 1.3555 1.3970 1.3542 3.7076 3.2283 3.0562 3.2352 2.2183 1.6139 1.2542 1.1709 1.2009 1.2669 1.6164 1.4099 1.9719 1.4876 1.5380 1.4352 1.7850 2.3999 1.4618 1.5779 1.6791 2.7879 2.5803 2.2181 6.0126 2.2436 3.9629 2.4767 3.3827 4.4895 7.7357 6.7585 6.3471 6.6985 7.1853 1.0795 1.0834 1.0870 1.0872 1.0865 1.0883 1.0924 1.0939 1.0944 1.0977 1.0946 1.0958 1.0652 1.0656
irintensity: 0.8666 0.6395 1.4538 0.8708 1.2677 1.2583 5.7278 8.1708 2.5366 5.1927 4.3310 0.6014 59.5642 4.4814 6.0114 7.5810 4.1096 3.3461 99.4064 90.4059 2.8751 5.5454 3.1657 2.5433 5.0866 11.1591 2.2659 5.1361 6.4215 4.0329 8.5309 61.2330 14.6236 35.7171 34.3816 54.1473 4.3223 1.0307 7.5517 10.0387 172.7499 8.9417 3.4565 4.6014 1.5533 1.0323 0.6124 7.9887 41.1999 34.6937 25.9090 13.0842 6.6236 14.6221 5.5850 9.5438 12.1749 59.7670 32.4650 5.2595 1.7832 11.1759 10.8001 7.1068 0.4565 2.2084 33.8561 46.4310 3.4025 13.8205 6.5689 4.1743 6.4453 0.4526 13.8654 10.9707 2.5126 2.9978 0.4607 2.6246 7.9293 5.3830 53.5369 13.7372 0.7043 8.5935 1.4957 8.6043 13.0425 10.8250 9.1462 53.4650 20.7573 10.5819 26.0329 1.2950
temp: 298.150 k
press: 1.00000 atm
elementType: 8 8 6 6 6 6 6 6 6 6 6 6 6 6 6 6 6 6 6 6 1 1 1 1 1 1 1 1 1 1 1 1 1 1
symmnumber: 1
zpe: 700997.7 jmol-1
zpe.correction: 0.266996 hartree
zpe.thermalcorrener: 0.282301 hartree
zpe.thermalcorrenthalpy: 0.283245 hartree
zpe.thermalcorrgfe: 0.224988 hartree
zpe.sumelectzpe: -843.393771 hartree
zpe.sumelectthermal: -843.378466 hartree
zpe.sumelectthermalent: -843.377522 hartree
zpe.sumelectthermalfe: -843.435779 hartree
dipole: -0.6729 1.6994 -1.4120
dipole: 2.3096
quadrupole: -104.2874 -105.0714 -120.9748
quadrupole: 5.1096 -8.4089 -0.4774
quadrupole: 5.8238 5.0398 -10.8636 5.1096 -8.4089 -0.4774
hfenergy: -843.660767 hartree
pointgroup: C01 [X(C18H14O2)]
dipole: 0.2645344 0.6446278 0.583255 debye
polarizability: 371.8118591|-7.8137609|204.269764|-9.2446833|7.4283711|88.8113749 unknown
InChI: InChI=1S/C18H14O2/c19-17-10-9-15-14-6-5-11-3-1-2-4-12(11)13(14)7-8-16(15)18(17)20/h1-10,17-20H
charge 0 multiplicity 1
34 atoms
O  -3.877519 -2.170535 -0.162015
O  -5.604788 0.176577 0.036834
C  -1.899771 -0.761669 0.137896
C  -3.403155 -0.878598 0.331441
C  -1.306447 0.526011 0.177565
C  0.130106 0.651568 0.106668
C  -4.171358 0.276914 -0.332693
C  0.948363 -0.536414 -0.005321
C  -1.095419 -1.918527 0.017091
C  2.409519 -0.412221 -0.068975
C  -2.202863 1.697316 0.271132
C  -3.546768 1.603848 0.040563
C  0.299358 -1.805404 -0.058615
C  0.782998 1.943557 0.133228
C  3.008317 0.8987 -0.029223
C  2.157903 2.060858 0.069233
C  3.282338 -1.539998 -0.168224
C  4.429217 1.037996 -0.089941
C  4.67437 -1.384341 -0.22623
C  5.257728 -0.085477 -0.187382
H  -3.610236 -0.801473 1.430816
H  -4.188217 0.132612 -1.430454
H  -1.58735 -2.893756 -0.026195
H  -1.776245 2.679575 0.496388
H  -4.194458 2.48856 0.040132
H  0.890489 -2.71947 -0.161902
H  0.179619 2.853251 0.195797
H  2.628406 3.051043 0.091154
H  2.869753 -2.552731 -0.199095
H  -4.870231 -2.126633 -0.161743
H  4.861794 2.045086 -0.058549
H  -5.696279 0.431988 0.992309
H  5.317581 -2.267993 -0.301479
H  6.346049 0.02898 -0.233214
