program: Gaussian 09
title: 000015777
version: EM64L-G09RevD.01
frameworkgroup: C1[X(C3H9O3P)]
method: RPBEPBE
basis: SDD
operation: Freq
keyword: #pfreq=noraman
keyword: PBEPBE/SDD
title: #p freq=noraman PBEPBE/SDD
converged: YES YES NO NO
title: Mulliken charges:
elementType: P O O O C C C H H H H H H H H H
charge: 1.128533 -0.531522 -0.490988 -0.611381 -0.224274 -0.651610 -0.491331 0.240075 0.219261 0.036200 0.212265 0.226213 0.233725 0.239209 0.213929 0.251696
chargesum: 0.00000
title: Mulliken charges with hydrogens summed into heavy atoms:
elementType: P O O O C C C
charge: 1.164733 -0.531522 -0.490988 -0.611381 0.235062 0.020593 0.213502
polarizability: 7.50109381e+01 -1.67527730e+00 7.01736670e+01 1.68077154e+00 -1.30904996e+00 5.49980126e+01
1716.lowfreq: -20.1224 -5.7121 -0.0024 -0.0014 -0.0006 8.2649 17.4256 60.6623 79.9028
frequency: 7.7849 60.6246 79.8683 114.5386 141.0321 179.1539 241.8201 287.5703 309.3897 360.5881 456.5124 612.2870 659.4366 805.4852 842.0056 859.7620 910.2939 966.5547 1028.0187 1061.7668 1107.2121 1109.5067 1124.9548 1134.2731 1253.5300 1356.3482 1394.5110 1425.9553 1458.5965 1459.2918 1468.1929 1477.2001 1490.0092 2203.7277 2962.3803 2991.0145 2995.9035 3055.8449 3062.1327 3091.9481 3108.7491 3125.2864
redmass: 2.5293 2.3649 2.3005 1.3345 4.0609 3.8293 1.1878 3.5986 6.7804 4.8535 8.3905 7.3146 4.6585 1.0874 1.7060 1.2057 1.7501 9.6438 2.8290 7.2789 1.3238 2.0317 1.3229 1.4309 1.1435 1.2576 1.2478 1.1199 1.0465 1.0440 1.0549 1.0491 1.0820 1.0410 1.0345 1.0518 1.0415 1.1072 1.1002 1.0983 1.1023 1.1017
irintensity: 0.4129 4.2546 4.6744 1.0734 11.9620 4.1762 0.1828 10.0404 22.8822 5.6426 32.3411 50.8320 79.1959 3.3017 244.8357 22.4745 28.1177 123.8840 110.4712 137.8939 2.4764 19.2756 0.1896 6.0904 0.2451 6.7955 26.6188 2.6569 11.5272 14.6693 14.1874 6.0037 8.8084 103.4267 52.8958 26.8819 22.5153 10.8859 40.8163 29.9716 39.5352 14.1339
temp: 298.150 k
press: 1.00000 atm
elementType: 15 8 8 8 6 6 6 1 1 1 1 1 1 1 1 1
symmnumber: 1
zpe: 322041.1 jmol-1
zpe.correction: 0.122659 hartree
zpe.thermalcorrener: 0.132719 hartree
zpe.thermalcorrenthalpy: 0.133663 hartree
zpe.thermalcorrgfe: 0.084757 hartree
zpe.sumelectzpe: -685.974417 hartree
zpe.sumelectthermal: -685.964356 hartree
zpe.sumelectthermalent: -685.963412 hartree
zpe.sumelectthermalfe: -686.012319 hartree
dipole: -1.1732 -3.9651 1.5265
dipole: 4.4078
quadrupole: -45.3438 -54.7813 -50.4484
quadrupole: -5.8462 6.4369 3.0119
quadrupole: 4.8474 -4.5901 -0.2572 -5.8462 6.4369 3.0119
hfenergy: -686.0970755 hartree
pointgroup: C01 [X(C3H9O3P1)]
dipole: 0.3974588 -1.6728668 0.2255237 debye
dipolederiv: 2.1717301 0.2159009 0.0357345 -0.1517154 1.5315147 -0.2774059 -0.1500405 -0.4491106 1.5227384 -1.4730868 -0.0099507 -0.3143326 0.0899919 -0.5452424 0.0342464 -0.4081878 0.0739381 -0.6916181 -0.8165982 -0.2892466 0.0973256 -0.341107 -0.9844094 0.2760081 0.2265299 0.3531799 -0.6363252 -0.6875554 -0.0062172 -0.0212309 0.0781743 -0.6744092 0.0994053 -0.0060633 0.0595701 -0.5858155 0.8176251 0.0259703 0.2037176 0.294973 0.2309661 0.0737586 0.4271713 -0.0262499 0.497514 -0.1420597 0.0855905 -0.0343895 0.0418832 0.0243296 -0.0064797 -0.0771364 0.0045794 0.0358727 0.2666028 0.0557968 0.0577818 0.2967868 0.6477953 -0.1724088 0.0741431 -0.0137844 0.2276674 -0.0019396 -0.0060122 -0.0296044 -0.0900792 -0.0967267 0.0236849 -0.0338518 0.0762438 0.0319909 -0.0499001 0.0233898 0.0784487 -0.0285107 0.0623989 -0.0282021 -0.0045758 -0.0375537 -0.1459178 -0.1901235 -0.0300426 -0.038446 -0.0485497 -0.188218 -0.1300853 -0.0192413 0.0255085 -0.2318739 -0.0743545 -0.037658 -0.1117182 -0.0494828 0.0600704 -0.0629327 -0.1256804 -0.0553665 0.0234638 0.0865119 -0.0744886 0.0365416 -0.0130289 -0.1098894 0.0759542 0.0372037 0.0704628 0.0786769 0.0809255 0.0147619 0.06388 0.0307313 0.0885721 -0.0008949 0.1130561 -0.0251638 -0.1020031 -0.0548157 0.122036 -0.0777437 0.0227902 -0.045656 0.0617907 -0.057073 0.0239705 0.0743889 0.0620532 -0.0436376 -0.0592688 -0.0779619 -0.0435722 -0.0119556 -0.1187832 -0.1179349 -0.1049286 0.0049849 -0.0461926 0.1133044 -0.0548952 0.0424763 0.0455169 0.1225293 0.0377108 0.0061692 unknown
polarizability: 75.0034293|2.3958003|67.7973237|1.6572202|-5.4228082|57.3818645 unknown
InChI: InChI=1S/C3H9O3P/c1-3-6-7(4)5-2/h7H,3H2,1-2H3
charge 0 multiplicity 1
16 atoms
P  -0.664025 0.457094 -1.080098
O  0.826131 -0.389502 -0.799822
O  -1.739084 -0.078037 0.181605
O  -0.599797 2.038709 -1.169806
C  1.848304 0.228498 0.098984
C  3.062336 -0.6943 0.061632
C  -1.966375 -1.530905 0.329718
H  2.085719 1.241464 -0.275279
H  1.428856 0.314302 1.119842
H  -1.064466 -0.30731 -2.237777
H  3.861889 -0.289115 0.709053
H  2.799674 -1.703894 0.420974
H  3.453866 -0.779143 -0.966113
H  -1.036448 -2.052096 0.620172
H  -2.366714 -1.977072 -0.603214
H  -2.717064 -1.619092 1.128829
