program: Gaussian 09
title: 000184939
version: EM64L-G09RevD.01
frameworkgroup: C1[X(C16H25NO)]
method: RPBEPBE
basis: SDD
operation: Freq
keyword: #p
keyword: freq=noraman
keyword: PBEPBE/SDD
title: #p freq=noraman PBEPBE/SDD
converged: YES YES NO NO
title: Mulliken charges:
elementType: O N C C C C C C C C C C C C C C C C H H H H H H H H H H H H H H H H H H H H H H H H H
charge: -0.453295 -0.051296 -0.049252 -0.408274 -0.410990 -0.400333 -0.240072 -0.404345 -0.384621 -0.374903 -0.755047 -0.405374 0.058404 -0.536119 0.164361 -0.312133 -0.344459 -0.189929 0.217663 0.199004 0.194053 0.249220 0.198444 0.195624 0.192788 0.240655 0.194740 0.188826 0.222156 0.184418 0.193724 0.220249 0.253264 0.210313 0.216330 0.201135 0.202767 0.230888 0.203169 0.275653 0.337738 0.240835 0.234020
chargesum: 0.00000
title: Mulliken charges with hydrogens summed into heavy atoms:
elementType: O N C C C C C C C C C C C C C C C C
charge: -0.115557 -0.051296 0.168411 -0.015217 0.036674 -0.011921 0.000584 -0.020779 0.021953 0.039070 -0.075141 -0.001472 0.058404 -0.102062 0.164361 -0.036480 -0.103624 0.044091
polarizability: 2.06762275e+02 -7.47508082e+00 1.87380774e+02 -7.23803799e+00 -1.08445277e+01 1.36808939e+02
1716.lowfreq: -16.4233 -3.5349 -0.0004 -0.0002 0.0007 7.6282 33.3451 82.6907 97.3572
frequency: 32.2877 82.6597 97.3385 107.6030 116.6301 126.9886 138.4500 183.5246 202.5407 210.2893 228.7147 244.9687 245.2435 249.9791 276.4709 280.3997 323.8899 332.3785 345.2363 394.1477 413.3840 438.7268 457.3814 481.3312 507.9236 522.4069 550.2024 632.1872 672.7540 698.2663 734.0477 744.7024 754.8257 772.1423 805.9237 813.9885 828.8269 840.9685 877.0071 883.1811 911.1976 921.4122 936.3564 954.1372 962.9157 978.1656 990.5938 994.7373 1006.2476 1036.7707 1043.8527 1061.4921 1077.2399 1080.4161 1087.6252 1102.3244 1114.2913 1127.8607 1149.0896 1160.1248 1168.4718 1181.1361 1209.3037 1218.9243 1232.3270 1250.9582 1254.0128 1260.5831 1271.9543 1280.8947 1291.6644 1298.7050 1305.0517 1315.6231 1322.9494 1329.1470 1340.7881 1342.9330 1345.7744 1352.1414 1357.8292 1363.8318 1370.9782 1384.7817 1406.5858 1444.4922 1457.1050 1460.2736 1462.6407 1465.8843 1468.2799 1472.5603 1477.6997 1480.6288 1488.0194 1493.1654 1567.0364 1578.3730 2949.9289 2953.8424 2957.9712 2966.2580 2969.7630 2971.6966 2971.8981 2975.0196 2980.8673 2992.8122 2997.4228 3004.8037 3006.0037 3012.8996 3019.2316 3030.9629 3047.7521 3056.6441 3066.1277 3066.2764 3100.4841 3130.5473 3151.9206 3173.9115 3560.2608
redmass: 3.7767 3.3590 3.9533 3.6553 3.4830 2.1499 2.9462 3.2464 2.6651 2.5555 2.6639 1.2455 2.3450 2.8108 2.0741 3.1678 2.6936 1.2071 2.8648 2.2565 3.8004 3.0897 2.8502 3.0526 2.7477 3.7315 3.6709 5.7224 3.1603 1.2090 2.4521 1.5810 1.7621 1.5823 2.2100 2.0351 2.1643 2.3400 2.2430 1.8652 2.1236 1.4713 1.9754 2.3902 2.9259 2.0911 2.1784 1.3370 2.5134 1.7144 2.2436 2.0195 2.3542 1.7474 1.8123 1.6761 2.3786 1.4205 1.4137 1.6541 1.1171 1.6762 1.3586 1.4621 1.5675 1.5602 1.9294 1.3502 1.4233 1.2774 1.3192 1.5265 1.2181 1.3048 1.5818 1.5700 1.4187 1.3366 1.4937 1.4232 1.4663 1.4859 1.3755 1.2213 2.3403 2.3518 1.0768 1.1037 1.0862 1.1329 1.0827 1.0696 1.0477 1.0907 1.0538 1.0885 6.7487 5.4271 1.0607 1.0600 1.0607 1.0622 1.0822 1.0672 1.0642 1.0631 1.0368 1.0865 1.0634 1.0983 1.0961 1.0975 1.0992 1.0951 1.1011 1.0994 1.0989 1.0994 1.0987 1.0874 1.0951 1.0970 1.0662
irintensity: 0.5313 0.0805 0.7572 2.1885 0.2722 0.2620 0.0069 2.1322 0.6985 0.8232 0.9033 1.0111 1.2347 0.3194 1.0162 9.8869 7.3384 140.1635 9.7899 2.8064 2.1431 0.2191 0.1106 4.0705 0.3180 6.3168 3.7370 6.8880 4.8716 16.7000 11.2523 16.4970 12.1954 28.7992 5.8376 4.4417 2.5082 15.1880 2.7548 0.2369 0.3110 1.4599 26.6673 5.1199 9.4588 17.5231 31.0255 0.4453 20.8363 6.6692 1.2471 3.8107 3.6324 4.2055 2.6818 0.3059 0.6609 2.6785 7.7458 1.5710 1.1913 1.1751 23.4411 2.8989 7.2123 5.9473 0.6135 6.9526 1.2979 1.5108 1.6788 9.1652 4.3277 3.3741 1.6535 2.0611 3.9388 3.9945 4.0161 5.3330 8.8763 2.2166 4.1257 26.8658 5.2022 37.2984 2.5686 11.9796 5.1558 14.8400 13.9523 5.2296 8.9085 3.0613 8.6528 13.9813 38.5379 32.6299 9.8799 27.6244 19.2767 51.3841 6.4328 25.1385 67.2475 57.2938 36.9868 23.5368 36.9436 20.6662 54.8057 31.0356 36.2014 63.1556 115.6987 38.9753 36.4261 58.7892 19.4370 7.3498 19.0031 7.2223 6.4151
temp: 298.150 k
press: 1.00000 atm
elementType: 8 7 6 6 6 6 6 6 6 6 6 6 6 6 6 6 6 6 1 1 1 1 1 1 1 1 1 1 1 1 1 1 1 1 1 1 1 1 1 1 1 1 1
symmnumber: 1
zpe: 994309.6 jmol-1
zpe.correction: 0.378713 hartree
zpe.thermalcorrener: 0.396598 hartree
zpe.thermalcorrenthalpy: 0.397542 hartree
zpe.thermalcorrgfe: 0.334316 hartree
zpe.sumelectzpe: -753.269123 hartree
zpe.sumelectthermal: -753.251237 hartree
zpe.sumelectthermalent: -753.250293 hartree
zpe.sumelectthermalfe: -753.313520 hartree
dipole: -0.8814 2.0327 -0.4757
dipole: 2.2661
quadrupole: -113.6917 -103.2962 -109.1017
quadrupole: 1.7276 -0.2394 -1.5436
quadrupole: -4.9952 5.4004 -0.4051 1.7276 -0.2394 -1.5436
hfenergy: -753.6478353 hartree
pointgroup: C01 [X(C16H25N1O1)]
dipole: 0.3380987 0.8026468 0.1904771 debye
polarizability: 206.4372218|7.8727388|187.4072982|-7.9099373|11.0734878|137.1074678 unknown
InChI: InChI=1S/C16H25NO/c1-13-9-6-4-2-3-5-7-10-14-11-8-12-15(17-14)16(13)18/h8,11-13,16,18H,2-7,9-10H2,1H3
charge 0 multiplicity 1
43 atoms
O  -3.437075 -0.225489 -1.364157
N  -0.078683 0.901515 -0.715127
C  -2.203227 -1.728628 0.083593
C  -0.850556 -2.140001 0.724171
C  0.315421 -2.440371 -0.24714
C  1.624553 -2.796733 0.508528
C  -2.062913 -0.528836 -0.903739
C  2.926521 -2.41783 -0.248002
C  3.064339 -0.906655 -0.586081
C  2.916442 0.029425 0.636198
C  -3.257889 -1.472964 1.185524
C  3.092555 1.534959 0.318659
C  -1.383872 0.71812 -0.336983
C  2.058022 2.125501 -0.691479
C  0.612438 1.988562 -0.245828
C  -2.063248 1.640228 0.497683
C  -0.00083 2.93678 0.614481
C  -1.353724 2.761725 0.981134
H  -2.568081 -2.566989 -0.546462
H  -1.036422 -3.027428 1.364335
H  -0.528081 -1.329821 1.412094
H  0.490351 -1.544078 -0.867087
H  0.036187 -3.262665 -0.937556
H  1.644111 -3.880564 0.74181
H  1.621755 -2.278781 1.488663
H  -1.441006 -0.855515 -1.761278
H  2.984822 -2.997865 -1.19223
H  3.795676 -2.732927 0.36653
H  2.307165 -0.629285 -1.342959
H  4.055649 -0.738068 -1.057039
H  3.661901 -0.257595 1.407336
H  1.920798 -0.120986 1.09482
H  -4.214662 -1.143977 0.747804
H  -3.434631 -2.402121 1.758456
H  -2.912539 -0.70328 1.90098
H  4.106038 1.710218 -0.096783
H  3.034627 2.111318 1.26476
H  2.164637 1.618667 -1.666406
H  2.29789 3.195546 -0.843667
H  -3.116815 1.476506 0.738926
H  -3.381776 0.440856 -2.095133
H  0.571714 3.799842 0.970694
H  -1.849979 3.492481 1.629455
