program: Gaussian 09
title: 000187237
version: EM64L-G09RevD.01
frameworkgroup: C1[X(C14H7Cl2F5)]
method: RPBEPBE
basis: SDD
operation: Freq
keyword: #p
keyword: freq=noraman
keyword: PBEPBE/SDD
title: #p freq=noraman PBEPBE/SDD
converged: YES YES NO NO
title: Mulliken charges:
elementType: Cl Cl F F F F F C C C C C C C C C C C C C C H H H H H H H
charge: 0.066582 0.028799 -0.178967 -0.177848 -0.122689 -0.151162 -0.149695 0.241345 0.113625 0.289574 0.263677 -0.357954 -0.206273 0.261317 -0.234191 -0.363379 -0.352464 -0.099569 -0.220067 -0.220652 -0.227798 0.279803 0.273640 0.267862 0.265061 0.237563 0.237307 0.236554
chargesum: 0.00000
title: Mulliken charges with hydrogens summed into heavy atoms:
elementType: Cl Cl F F F F F C C C C C C C C C C C C C C
charge: 0.066582 0.028799 -0.178967 -0.177848 -0.122689 -0.151162 -0.149695 0.241345 0.113625 0.289574 0.263677 -0.078151 -0.206273 0.261317 0.039449 -0.095517 -0.087403 -0.099569 0.017496 0.016655 0.008756
polarizability: 2.36374202e+02 -9.83551866e+00 1.54837026e+02 4.01489723e+00 3.02131665e-02 1.17415726e+02
1716.lowfreq: -5.8428 -4.3635 -0.0020 -0.0008 -0.0003 4.0871 11.4170 38.7700 57.8329
frequency: 11.0207 38.7609 57.8280 67.5219 71.6776 87.5147 155.2558 163.6883 170.1883 202.1356 215.7132 228.5008 232.5655 244.0980 269.4470 295.6754 314.6727 341.5119 375.8240 401.8591 412.3799 439.5949 452.1237 466.8507 469.8104 503.1789 557.1496 586.0926 592.1439 607.0840 614.1268 632.2450 664.6466 703.3206 741.7394 748.3799 761.1980 785.3397 830.4001 858.9136 928.2769 940.9910 949.0773 964.2631 980.4782 982.9367 985.8465 987.6418 991.5271 1003.5326 1031.6862 1070.7393 1093.0335 1140.1362 1171.2997 1176.7008 1192.0948 1196.6883 1243.5427 1257.7087 1319.2185 1338.8837 1357.2203 1383.9367 1436.6485 1443.0430 1483.0766 1559.5908 1584.8593 1594.4265 1613.0316 3134.4856 3145.4865 3157.3607 3166.9044 3170.3579 3175.6635 3188.7443
redmass: 8.5513 4.4139 6.7510 16.9079 11.1921 10.0777 10.1490 10.7225 10.6732 9.5191 18.1367 15.7343 6.3799 10.5658 18.3861 20.6985 9.1179 8.7806 6.7658 2.8274 9.9707 8.9863 9.3436 11.6928 6.2662 5.6564 11.8339 7.0474 5.7532 6.0791 6.4420 14.0023 7.0211 1.8046 8.6924 8.2835 3.0495 3.2661 1.3854 1.2549 1.8208 5.7825 3.8777 1.4826 9.5490 5.2151 2.0041 3.8629 6.0490 1.3503 2.0903 11.6793 1.6181 2.6627 3.4728 1.0521 1.1461 2.1746 3.7141 2.5823 1.3100 11.2241 4.5937 9.3749 2.2082 2.8208 2.2944 7.9439 6.8957 6.2827 6.0320 1.0855 1.0889 1.0932 1.0962 1.0894 1.1009 1.0965
irintensity: 0.0412 0.0854 0.2177 0.0166 0.9213 0.0494 0.2759 0.2415 0.9444 0.3859 1.4045 0.8643 3.2817 0.3381 0.4701 1.1932 1.5978 4.4770 0.8408 0.0370 7.7841 9.0351 6.8987 4.9506 0.0117 13.6266 23.9483 0.7715 12.0131 2.5119 0.1496 17.3895 19.5455 55.5306 29.6823 1.6958 16.8082 76.7038 44.1673 2.0968 47.9881 44.1067 36.3069 0.5709 19.5050 188.3031 40.2046 127.9990 48.5279 1.4577 3.6797 88.7504 0.0793 103.2546 156.8422 0.0551 10.7174 23.6576 236.9328 161.1100 1.2984 2.5422 87.8503 0.2915 16.8166 22.8603 2.5033 20.9310 3.9037 0.1487 1.8642 0.1239 7.5221 16.6993 11.2625 0.2246 11.2221 1.1369
temp: 298.150 k
press: 1.00000 atm
elementType: 17 17 9 9 9 9 9 6 6 6 6 6 6 6 6 6 6 6 6 6 6 1 1 1 1 1 1 1
symmnumber: 1
zpe: 454062.5 jmol-1
zpe.correction: 0.172943 hartree
zpe.thermalcorrener: 0.191444 hartree
zpe.thermalcorrenthalpy: 0.192389 hartree
zpe.thermalcorrgfe: 0.124089 hartree
zpe.sumelectzpe: -1955.519435 hartree
zpe.sumelectthermal: -1955.500933 hartree
zpe.sumelectthermalent: -1955.499989 hartree
zpe.sumelectthermalfe: -1955.568289 hartree
dipole: -4.0632 5.8593 -0.0679
dipole: 7.1306
quadrupole: -121.3531 -137.3131 -128.8824
quadrupole: -7.3333 0.0802 -0.1203
quadrupole: 7.8298 -8.1302 0.3004 -7.3333 0.0802 -0.1203
hfenergy: -1955.6923778 hartree
pointgroup: C01 [X(C14H7Cl2F5)]
dipole: -1.7921322 -2.1583266 0.0140382 debye
polarizability: 237.231131|2.7828675|153.7130036|-6.5417369|1.186587|117.6828196 unknown
InChI: InChI=1S/C14H7Cl2F5/c15-10-7-6-9(11(12(10)16)14(19,20)21)13(17,18)8-4-2-1-3-5-8/h1-7H
charge 0 multiplicity 1
28 atoms
Cl 4.391706 -0.366704 -0.273188
Cl 3.51731 -3.427798 -0.13701
F  -0.819207 1.736524 -1.047568
F  -0.859271 1.662807 1.274635
F  1.194447 2.707302 0.17602
F  3.098358 1.912184 1.030063
F  2.804884 2.024582 -1.23305
C  0.263303 -0.120698 0.066608
C  -0.935679 0.842854 0.085942
C  1.642173 0.268646 -0.012255
C  -2.326829 0.231467 0.03696
C  -0.056213 -1.497927 0.109617
C  2.637364 -0.753681 -0.092498
C  2.149712 1.712654 -0.011097
C  0.930397 -2.495299 0.063285
C  -3.025934 -0.040176 1.23717
C  -2.919526 -0.069121 -1.21326
C  2.277127 -2.12122 -0.048686
C  -4.316502 -0.611271 1.184849
C  -4.209692 -0.640641 -1.260182
C  -4.909586 -0.91587 -0.062264
H  -1.102921 -1.800661 0.176495
H  0.659056 -3.553324 0.102842
H  -2.57179 0.214051 2.199568
H  -2.383722 0.162031 -2.1391
H  -4.858784 -0.811871 2.114903
H  -4.668962 -0.863904 -2.228955
H  -5.912118 -1.355737 -0.10074
