program: Gaussian 09
title: 000187218
version: EM64L-G09RevD.01
frameworkgroup: C1[X(C12H8Cl2O)]
method: RPBEPBE
basis: SDD
operation: Freq
keyword: #p
keyword: freq=noraman
keyword: PBEPBE/SDD
title: #p freq=noraman PBEPBE/SDD
converged: YES YES NO NO
title: Mulliken charges:
elementType: Cl Cl O C C C C C C C C C C C C H H H H H H H H
charge: -0.050358 -0.059197 -0.417021 0.399285 0.436316 -0.513822 -0.405455 -0.332431 -0.374465 0.410977 -0.217611 -0.325250 -0.228831 -0.238348 -0.225800 0.276762 0.263714 0.256117 0.254891 0.257275 0.234786 0.237948 0.360519
chargesum: 0.00000
title: Mulliken charges with hydrogens summed into heavy atoms:
elementType: Cl Cl O C C C C C C C C C C C C
charge: -0.050358 -0.059197 -0.056502 0.399285 0.436316 -0.237060 -0.141741 -0.332431 -0.118348 0.410977 0.037279 -0.325250 0.028445 -0.003562 0.012148
polarizability: 2.36505777e+02 -1.21160286e+01 1.47540259e+02 -3.27985503e+00 -5.35031475e+00 7.63429444e+01
1716.lowfreq: -3.9765 0.0016 0.0017 0.0022 5.2806 8.5575 44.3181 52.5570 81.2042
frequency: 44.3141 52.5447 81.2024 144.0268 163.7861 198.2720 229.3172 243.8828 271.8317 308.7416 370.8765 388.6395 424.8968 451.5953 458.2158 466.7978 500.8642 545.7152 554.2597 620.9435 630.1986 671.5768 704.5315 716.7859 731.3013 762.1485 811.2216 864.8202 884.1712 891.1642 944.4928 951.4746 986.5371 1005.0528 1011.2689 1029.0948 1066.4316 1123.4834 1149.8849 1173.2363 1174.5742 1218.4463 1252.3011 1271.3317 1313.4661 1355.5526 1374.9391 1420.2373 1434.2578 1456.2986 1487.3551 1565.3124 1584.3889 1603.8854 1610.4610 3135.4598 3147.4235 3161.7349 3162.4587 3164.5628 3176.8844 3182.7714 3502.3102
redmass: 7.5269 9.2918 5.5585 7.2603 6.2252 7.3019 8.7864 6.8288 7.2933 6.0549 8.2469 6.3142 4.1402 1.1733 3.5562 3.4522 4.9645 7.6394 4.0080 5.4768 6.8240 7.2032 3.4736 6.9249 3.5244 1.2439 1.3656 1.4053 3.9181 1.6858 1.3318 1.3841 1.3318 5.2812 6.1035 3.5601 1.8009 1.7037 1.4600 1.3051 1.1279 1.8613 1.6016 1.4424 2.0879 5.9385 9.1692 2.4650 2.8151 2.7124 3.2231 6.0301 7.6996 7.0166 6.6247 1.0858 1.0904 1.0886 1.0951 1.0921 1.0998 1.0972 1.0648
irintensity: 0.4538 0.4221 0.4180 0.4671 0.7469 0.5214 4.8513 1.0410 0.3077 0.9604 6.9433 3.8855 7.5464 136.6529 15.7646 4.2385 15.9745 14.9852 5.2283 2.2057 1.7629 21.4235 1.4859 21.2825 3.3573 103.0497 23.0328 3.1912 21.9857 19.2750 0.9592 0.5788 0.0640 44.9718 35.4241 30.8542 10.3445 3.4924 2.7486 129.3606 51.3389 5.2739 11.1228 48.1308 3.6947 10.0844 22.1393 22.6160 6.8208 110.2775 27.7241 5.9472 48.4019 2.4665 15.5012 1.6307 9.6144 1.6569 11.4771 2.5740 14.1880 1.8921 64.5365
temp: 298.150 k
press: 1.00000 atm
elementType: 17 17 8 6 6 6 6 6 6 6 6 6 6 6 6 1 1 1 1 1 1 1 1
symmnumber: 1
zpe: 426983.2 jmol-1
zpe.correction: 0.162629 hartree
zpe.thermalcorrener: 0.175465 hartree
zpe.thermalcorrenthalpy: 0.176410 hartree
zpe.thermalcorrgfe: 0.122191 hartree
zpe.sumelectzpe: -1456.379905 hartree
zpe.sumelectthermal: -1456.367069 hartree
zpe.sumelectthermalent: -1456.366125 hartree
zpe.sumelectthermalfe: -1456.420344 hartree
dipole: 1.3350 -1.0088 -1.1111
dipole: 2.0086
quadrupole: -86.6760 -97.6131 -103.7951
quadrupole: -4.5048 -1.2728 -0.8204
quadrupole: 9.3521 -1.5850 -7.7671 -4.5048 -1.2728 -0.8204
hfenergy: -1456.5425348 hartree
pointgroup: C01 [X(C12H8Cl2O1)]
dipole: -0.5636781 0.529483 -0.1625465 debye
dipolederiv: -0.1951052 0.160827 0.0330119 0.1192679 -0.652976 -0.1584576 0.0485796 -0.1615831 -0.1038839 -0.9080106 0.0040676 0.0402966 0.0049653 -0.0699748 -0.0430357 0.0292781 -0.0407789 -0.1499878 -0.6532197 -0.2261399 -0.4962956 -0.2937905 -0.4792701 -0.1907172 -0.6490772 -0.1912218 -0.8278799 0.3219945 0.0472609 0.0557785 -0.0879378 -0.0009231 0.077624 -0.0923309 0.0377526 0.1527848 0.3289216 0.0657785 -0.0052115 0.0165636 -0.2173231 -0.0851046 -0.0508902 -0.0654994 -0.0179672 -0.2111181 -0.1108576 -0.2714921 0.0957935 -0.1440993 0.0186099 0.0739317 0.0238565 -0.0772249 -0.2515977 0.0292583 0.0876765 0.0058457 -0.1172623 0.0535965 0.0205753 0.0178222 -0.0914499 0.1155532 -0.2990947 -0.0644518 -0.1653532 0.9190256 0.2507415 -0.0114647 0.2781729 -0.0009455 -0.1178517 -0.0089552 -0.0146288 0.064593 0.0314571 0.0312618 -0.0157932 0.0454203 -0.1256336 0.270463 0.2512368 0.5728424 0.2554901 0.2207184 0.257415 0.6684568 0.2667146 0.6873315 -0.0889026 -0.0297917 -0.0678038 0.0632241 -0.0477073 0.0363936 0.0903375 0.0408697 0.0207416 1.1196821 0.0060026 -0.0138788 -0.1287773 -0.1201714 -0.002061 -0.3139375 -0.0054583 -0.1259974 -0.1125869 0.1424045 0.0365684 0.1294468 -0.1816821 -0.0159496 0.0188063 -0.0275978 -0.1067467 -0.0680383 -0.0551333 -0.0232543 -0.0822897 0.0579682 0.0724968 0.0034622 0.0654908 -0.1281205 0.0486428 0.0197786 -0.0022555 -0.0227028 0.0110915 0.0523585 -0.014036 0.0489638 -0.1378876 0.0673695 0.0287452 0.0587233 0.025484 0.1317335 -0.058775 0.0607078 -0.0452872 0.032496 0.0388574 -0.0245214 -0.0704939 -0.017725 0.118559 -0.0623929 -0.0731766 -0.0440361 0.0350866 0.0376166 -0.0867426 -0.0184271 -0.0982041 -0.0005526 -0.030389 -0.0161055 -0.0444068 0.1278269 0.0492582 0.0198897 0.0576923 0.0243863 0.1337831 -0.0613587 0.0586637 -0.0581323 0.0236223 0.0357466 -0.0550777 -0.0121265 -0.0792379 0.0134673 -0.0429444 -0.0207999 -0.0405025 0.1502762 0.0385522 0.0592892 0.0231346 0.0863567 -0.0576906 -0.0724158 0.0317381 -0.0689093 0.1396937 -0.1162608 0.0260874 0.0191261 0.0217227 0.0831434 -0.0244368 0.0166649 -0.0294892 0.1532992 0.2500339 0.0356878 0.0754691 0.0628788 0.3686855 -0.0024592 0.1364099 -0.002161 0.3705662 unknown
polarizability: 237.8557851|-3.8561672|120.4691675|-3.699504|34.215094|102.0640274 unknown
InChI: InChI=1S/C12H8Cl2O/c13-10-4-2-1-3-9(10)8-5-6-11(14)12(15)7-8/h1-7,15H
charge 0 multiplicity 1
23 atoms
Cl -1.581505 -2.585149 -0.857515
Cl 4.847893 -0.04156 -0.472823
O  3.142762 0.992372 1.868519
C  0.204559 0.037256 -0.193806
C  -1.282674 0.131754 -0.086349
C  1.005291 0.52884 0.865952
C  0.837903 -0.481032 -1.356756
C  -2.18706 -0.922421 -0.380834
C  -1.865176 1.361028 0.34029
C  2.414977 0.503723 0.784469
C  2.24471 -0.507861 -1.453817
C  3.014907 -0.018444 -0.386607
C  -3.58459 -0.777839 -0.273992
C  -3.259562 1.529159 0.456663
C  -4.126086 0.457552 0.143771
H  0.555375 0.913685 1.786055
H  0.236495 -0.851527 -2.190323
H  -1.195114 2.200191 0.556936
H  2.734929 -0.899139 -2.349624
H  -4.235778 -1.625583 -0.505045
H  -3.666778 2.492345 0.781028
H  -5.211801 0.573423 0.225262
H  4.117624 0.908425 1.691845
