program: Gaussian 09
title: 000187216
version: EM64L-G09RevD.01
frameworkgroup: C1[X(C12H8Cl2O)]
method: RPBEPBE
basis: SDD
operation: Freq
keyword: #p
keyword: freq=noraman
keyword: PBEPBE/SDD
title: #p freq=noraman PBEPBE/SDD
converged: YES YES NO NO
title: Mulliken charges:
elementType: Cl Cl O C C C C C C C C C C C C H H H H H H H H
charge: -0.051503 -0.043787 -0.414332 0.461839 0.406785 -0.528888 -0.389326 -0.326504 -0.344039 0.364269 -0.191930 -0.353962 -0.226827 -0.231054 -0.224962 0.257756 0.255749 0.234450 0.260071 0.257271 0.235029 0.236938 0.356956
chargesum: 0.00000
title: Mulliken charges with hydrogens summed into heavy atoms:
elementType: Cl Cl O C C C C C C C C C C C C
charge: -0.051503 -0.043787 -0.057376 0.461839 0.406785 -0.528888 -0.131569 -0.326504 -0.088291 0.364269 0.042521 -0.093891 0.030444 0.003975 0.011976
polarizability: 1.94101349e+02 -1.72804690e+01 1.53527093e+02 7.50469904e-02 1.01003944e+00 9.45537335e+01
1716.lowfreq: -6.4539 -2.7701 -0.0031 -0.0022 -0.0012 6.9142 28.3448 59.0910 72.7064
frequency: 28.1612 59.0852 72.7020 126.6020 148.8735 203.0154 239.5507 256.1185 275.7877 288.2597 369.1089 383.1452 416.4018 454.5350 456.8222 481.6030 507.8349 531.7606 565.3877 602.8922 624.4424 673.8232 708.5276 730.6433 741.3668 760.8611 793.5745 864.9708 883.3097 890.1719 950.1284 971.6155 986.6982 1002.6778 1019.5039 1033.6563 1077.9210 1107.1275 1123.9383 1173.0679 1174.4005 1183.9555 1250.2383 1292.5454 1317.3548 1358.2014 1376.9022 1414.6897 1424.4665 1451.5276 1487.6191 1568.2720 1587.9990 1601.0922 1608.8011 3137.4271 3145.8854 3149.4289 3164.1543 3166.4600 3176.7595 3180.7290 3492.8976
redmass: 8.8739 8.3295 6.1069 8.1549 5.5140 7.2013 5.1612 7.1724 8.6096 6.3566 5.7512 8.0237 6.9176 3.7596 1.1140 4.8461 3.7915 6.1531 4.5881 4.8643 6.9298 7.2742 3.1265 3.6305 6.5994 1.2511 1.5812 1.4446 5.1330 1.4121 1.3816 1.3313 1.3348 6.8282 7.3106 2.5790 1.9209 1.8997 1.6436 1.1169 1.4218 1.2099 1.4772 1.5342 3.0510 7.2963 6.5180 2.6380 2.5448 2.4222 3.3617 6.1332 6.1827 7.2471 7.5933 1.0857 1.0870 1.0907 1.0956 1.0932 1.1000 1.0986 1.0647
irintensity: 0.1754 0.4647 0.5725 0.5409 0.1826 0.2210 1.5426 1.8729 1.6612 4.5745 1.1732 4.1121 8.1126 18.1288 132.3808 9.0567 3.5121 8.1620 4.5566 0.6389 12.3407 29.2788 8.1056 1.9657 8.6231 95.1644 42.8795 1.7709 21.6199 1.1417 0.5521 0.4610 0.4126 48.9286 36.6498 3.9899 5.4732 2.3912 2.6244 46.1664 192.3327 0.5467 8.1888 12.5112 5.7867 5.9835 1.5698 84.5657 40.9877 43.8910 7.9302 7.7604 10.0775 29.3528 21.1294 0.5913 7.1201 11.3439 12.1113 5.8388 13.4156 6.6039 47.4509
temp: 298.150 k
press: 1.00000 atm
elementType: 17 17 8 6 6 6 6 6 6 6 6 6 6 6 6 1 1 1 1 1 1 1 1
symmnumber: 1
zpe: 426453.6 jmol-1
zpe.correction: 0.162428 hartree
zpe.thermalcorrener: 0.175344 hartree
zpe.thermalcorrenthalpy: 0.176289 hartree
zpe.thermalcorrgfe: 0.121679 hartree
zpe.sumelectzpe: -1456.377099 hartree
zpe.sumelectthermal: -1456.364182 hartree
zpe.sumelectthermalent: -1456.363238 hartree
zpe.sumelectthermalfe: -1456.417848 hartree
dipole: 1.4675 -0.9227 1.5120
dipole: 2.3003
quadrupole: -93.1604 -94.1310 -101.0159
quadrupole: -4.3002 0.6976 2.0116
quadrupole: 2.9421 1.9714 -4.9135 -4.3002 0.6976 2.0116
hfenergy: -1456.5395266 hartree
pointgroup: C01 [X(C12H8Cl2O1)]
dipole: -0.6416217 0.0661507 -0.6348043 debye
dipolederiv: -0.2236853 -0.1194062 0.0168685 -0.1060486 -0.6601834 0.0103046 -0.0042128 0.0078994 -0.038593 -0.2044956 -0.0722174 -0.1688077 -0.0860572 -0.1659756 -0.240878 -0.1392839 -0.2386807 -0.5709492 -0.7262671 0.564213 0.0105028 0.6855576 -0.8355751 -0.013778 0.0159053 -0.0137078 -0.3953405 0.2525312 -0.1598054 -0.0155278 0.0852231 -0.0015192 -0.0331063 0.042439 0.0135126 0.0210191 0.2690127 -0.037223 -0.0916795 0.0624746 -0.0590207 -0.0807587 -0.050137 -0.1048055 -0.1835954 -0.0908259 0.4960847 -0.0181426 0.0894098 0.7862584 -0.0217388 -0.0314639 -0.0272703 -0.1104 -0.273429 -0.035783 0.0050112 -0.1009898 -0.085695 0.0008208 -0.0109711 0.0269325 -0.1353467 0.1830833 0.1381678 0.3140393 0.069252 0.1230412 0.4005955 0.1767149 0.3860686 0.7936102 -0.0931456 0.0077313 -0.0042535 -0.0088272 -0.0700104 0.0778145 -0.016865 0.046915 0.0278683 0.5179408 -0.586678 -0.0033818 -0.7896361 0.5496921 0.026597 0.0027946 0.0133071 0.1162577 0.1863053 0.0920568 -0.0048277 -0.06339 0.1291184 0.0115124 -0.0239101 0.0076521 -0.1269568 -0.0235188 -0.0905744 0.0044933 0.3210653 -0.1563998 -0.0064723 0.0034939 0.002195 -0.1781411 -0.1473538 -0.0593023 -0.146985 -0.0407714 -0.1255086 -0.0455541 -0.121446 -0.0348594 -0.1724592 -0.0709709 0.0424446 0.0669427 0.0176746 -0.1028105 0.089675 0.0517494 0.0906555 0.0196901 0.083816 0.0159251 -0.0279248 0.0345014 -0.1124817 0.0708866 0.0256652 0.0737431 0.0101278 0.0247137 0.0737121 0.0007017 0.0869562 0.0029027 0.0000311 0.0020799 -0.0147987 0.138394 0.0362293 0.0224846 0.0780488 0.0271771 0.1060276 -0.0575902 0.0879604 -0.0453264 0.0106942 0.0463299 -0.0626729 0.0032723 -0.0805966 -0.0789243 -0.0008288 -0.0007792 -0.0047701 0.1537889 -0.0497223 -0.0209318 0.0026531 -0.0149074 0.0810641 -0.0008641 0.0069064 -0.0033947 0.1741896 0.0375694 0.0152881 0.0551255 0.0249161 0.136233 -0.0569381 0.0734466 -0.0572337 0.0233909 0.0347465 -0.0345184 -0.0561186 -0.0484093 0.1110614 -0.0955246 -0.0754981 -0.0933645 -0.0291721 -0.1152192 -0.0324432 -0.0147045 -0.0322439 0.140782 -0.0358791 -0.0111442 -0.032572 0.091802 0.3463556 -0.1565524 -0.0053057 -0.1323304 0.2879234 0.0016735 -0.0034444 0.0019029 0.3601214 unknown
polarizability: 198.5571331|9.5724916|136.2236072|2.938797|23.1103716|107.4014352 unknown
InChI: InChI=1S/C12H8Cl2O/c13-10-6-2-1-4-8(10)9-5-3-7-11(15)12(9)14/h1-7,15H
charge 0 multiplicity 1
23 atoms
Cl 0.833997 -2.46119 -0.167181
Cl -1.23242 1.283524 2.388732
O  3.721323 -1.527448 -0.21278
C  0.454713 0.355845 -0.144424
C  -1.023928 0.13383 -0.181992
C  1.387307 -0.705261 -0.18169
C  0.975551 1.677707 -0.119801
C  -1.89817 0.537085 0.857825
C  -1.618366 -0.472001 -1.323427
C  2.789904 -0.490677 -0.189281
C  2.367736 1.909506 -0.134028
C  3.278395 0.835213 -0.170981
C  -3.294383 0.360047 0.784741
C  -3.012442 -0.658385 -1.420128
C  -3.854439 -0.239502 -0.364588
H  0.274219 2.516592 -0.092697
H  -0.96404 -0.79045 -2.14155
H  2.746875 2.93627 -0.117002
H  4.360982 0.989396 -0.17941
H  -3.927724 0.680869 1.616622
H  -3.438947 -1.124712 -2.314157
H  -4.938767 -0.378773 -0.42779
H  3.25542 -2.406186 -0.202514
