program: Gaussian 09
title: 000187231
version: EM64L-G09RevD.01
frameworkgroup: C1[X(C24H15FO2)]
method: RPBEPBE
basis: SDD
operation: Freq
keyword: #p
keyword: freq=noraman
keyword: PBEPBE/SDD
title: #p freq=noraman PBEPBE/SDD
converged: NO YES NO NO
title: Mulliken charges:
elementType: F O O C C C C C C C C C C C C C C C C C C C C C C C C H H H H H H H H H H H H H H H
charge: -0.205026 -0.443754 -0.442000 -0.014147 0.032464 0.278690 0.014418 -0.256880 0.507969 0.398939 0.343848 0.517239 -0.134939 -0.797594 -0.479422 0.162201 -0.475604 -0.498647 -0.387308 0.480957 -0.505530 -0.809072 -0.247468 -0.311379 -0.621141 -0.414110 0.335521 0.278272 0.202191 0.247880 0.311447 0.223440 0.245663 0.244085 0.246355 0.250385 0.257634 0.231127 0.343466 0.272890 0.359435 0.257507
chargesum: 0.00000
title: Mulliken charges with hydrogens summed into heavy atoms:
elementType: F O O C C C C C C C C C C C C C C C C C C C C C C C C
charge: -0.205026 -0.100289 -0.082565 -0.014147 0.032464 0.278690 0.014418 0.021392 0.507969 0.398939 0.343848 0.517239 0.067252 -0.549714 -0.167975 0.162201 -0.252164 -0.252984 -0.143223 0.480957 -0.259175 -0.558688 0.010165 -0.080253 -0.348251 -0.156604 0.335521
polarizability: 5.66164645e+02 -2.34822019e+01 2.95996699e+02 5.22151162e+00 3.76931478e+00 1.10717700e+02
1716.lowfreq: -8.2264 -0.0006 -0.0005 0.0002 3.6740 7.3209 31.3252 53.1965 65.6108
frequency: 31.2908 53.1814 65.6040 90.7550 104.3300 119.4866 165.0259 198.4603 208.6086 223.5550 244.9156 260.4886 284.9298 292.3065 315.6994 331.9229 354.4441 366.5841 371.1375 383.5460 413.0375 434.6580 454.7551 462.5771 481.5711 487.3214 498.4995 511.5966 515.1211 539.9176 543.3172 550.6651 559.2757 578.7016 597.1977 604.3913 637.1874 655.6473 687.2366 694.1598 726.3693 751.2451 763.0079 768.4620 790.6810 797.2366 812.6942 821.1258 841.6537 853.5263 859.2266 867.8355 876.8233 921.5971 939.7895 941.8424 948.0799 950.2232 959.1757 976.3553 990.4621 1009.1144 1013.6314 1030.5792 1044.8889 1060.6252 1107.9937 1122.2263 1137.6628 1157.7647 1167.1744 1169.8110 1183.0240 1199.4483 1214.9122 1223.6009 1235.1496 1240.1010 1255.6770 1279.4253 1289.3022 1312.3593 1318.5790 1330.6952 1351.3341 1357.5349 1365.1071 1388.1853 1393.0432 1409.4220 1413.7108 1423.4027 1431.0482 1447.3012 1469.4825 1473.5216 1486.3819 1527.5999 1560.3378 1579.2088 1599.5586 1614.0599 1625.8406 1635.6568 1656.2819 2852.3338 3005.0500 3120.5900 3123.2941 3126.5852 3127.1728 3145.6925 3147.8898 3160.4183 3164.1402 3168.8882 3179.2117 3182.5359 3526.6475 3536.5493
redmass: 7.0673 4.9291 7.2707 4.3603 6.9198 6.9853 4.8319 5.9578 4.8313 4.7094 7.8803 5.2447 4.9523 5.6876 4.2980 4.2640 2.5069 4.4613 3.4413 2.1678 3.7487 6.0929 3.3013 5.5438 3.8043 5.2986 1.2344 3.5675 5.3957 4.1398 5.2485 5.5937 3.4955 4.7014 3.8321 6.3208 3.2830 6.7198 3.6046 4.1742 3.6356 4.7977 2.3269 2.3956 5.0178 2.5877 1.7136 1.4711 2.5755 4.7020 1.9609 2.5699 2.1955 1.9325 4.2338 2.2621 4.2985 1.4188 3.3239 1.4430 1.4603 1.3888 2.4988 5.4861 5.5777 2.8226 2.2593 2.5017 1.8553 1.6695 1.2107 1.5349 1.3197 1.4317 1.3567 1.5246 1.2724 1.3330 2.1067 1.5517 2.4047 1.7258 1.9928 2.9177 1.2270 1.6935 2.6653 2.6706 3.7333 4.2168 2.6845 8.8632 4.1975 4.9178 3.2656 4.0035 5.6256 4.3247 7.2548 7.4198 6.4951 6.8149 6.8240 7.2106 7.6284 1.0794 1.0832 1.0909 1.0867 1.0911 1.0881 1.0889 1.0986 1.0866 1.0926 1.0984 1.0955 1.0967 1.0649 1.0657
irintensity: 0.3498 1.1436 0.5146 0.4578 0.8546 0.8510 3.7970 0.5401 2.8704 4.2391 2.3954 1.6397 12.3111 3.9291 0.0369 0.3311 36.3944 6.7515 9.6738 42.6040 0.2310 2.4168 6.6310 6.9294 3.3046 3.1192 252.8044 12.1673 8.8767 3.5179 6.3438 1.0453 17.3371 7.2055 2.8004 10.6109 6.9299 0.8010 1.1049 14.3921 19.2822 19.7424 11.8511 2.4293 5.0789 14.8321 64.7563 0.0447 7.5790 0.9877 4.1975 13.7758 2.9456 11.1161 40.1285 101.8055 45.4656 0.4091 22.8286 14.1126 0.1145 1.8295 31.9697 0.2638 125.6460 12.8775 17.0024 3.7126 46.1269 43.5622 3.2098 7.4601 15.7779 34.4725 20.3354 31.0962 63.8344 7.3005 18.2876 7.9162 7.7041 1.3646 0.7418 11.8788 34.1903 35.1318 0.4280 6.2627 4.7156 4.1459 2.0283 0.5673 0.6485 16.1571 57.7527 0.3844 2.5150 47.2697 12.8586 0.6125 14.0377 5.0466 42.5535 67.1804 3.2541 55.7482 10.3351 3.8882 1.2062 7.9032 20.9830 5.2348 31.4235 8.5699 4.2787 13.4865 4.2291 13.0710 11.6345 4.8437
temp: 298.150 k
press: 1.00000 atm
elementType: 9 8 8 6 6 6 6 6 6 6 6 6 6 6 6 6 6 6 6 6 6 6 6 6 6 6 6 1 1 1 1 1 1 1 1 1 1 1 1 1 1 1
symmnumber: 1
zpe: 833852.7 jmol-1
zpe.correction: 0.317598 hartree
zpe.thermalcorrener: 0.337239 hartree
zpe.thermalcorrenthalpy: 0.338184 hartree
zpe.thermalcorrgfe: 0.270475 hartree
zpe.sumelectzpe: -1172.069499 hartree
zpe.sumelectthermal: -1172.049858 hartree
zpe.sumelectthermalent: -1172.048914 hartree
zpe.sumelectthermalfe: -1172.116622 hartree
dipole: -0.6325 1.5470 1.3263
dipole: 2.1336
quadrupole: -179.0434 -134.4863 -158.0144
quadrupole: -4.8166 -5.7603 -2.3753
quadrupole: -21.8620 22.6951 -0.8331 -4.8166 -5.7603 -2.3753
hfenergy: -1172.3870972 hartree
pointgroup: C01 [X(C24H15F1O2)]
dipole: -0.281259 0.5928493 0.5235159 debye
polarizability: 567.1723877|-13.6192697|294.5128118|13.6832269|5.8658394|111.1938439 unknown
InChI: InChI=1S/C24H15FO2/c25-16-4-5-17-15(11-16)10-13-2-1-12-9-14-3-8-20(26)24(27)23(14)19-7-6-18(17)21(13)22(12)19/h1-11,20,24,26-27H
charge 0 multiplicity 1
42 atoms
F  7.205212 -0.80094 0.17562
O  -3.293923 -2.808746 0.406868
O  -6.076366 -2.375155 -0.217062
C  -0.576738 0.734495 -0.028313
C  -2.818654 -0.356473 -0.143433
C  -1.387331 -0.461804 -0.132041
C  0.861706 0.649186 0.016616
C  -3.749649 -1.567047 -0.279461
C  -1.216981 2.027152 0.006907
C  -3.427679 0.936796 -0.169143
C  1.52178 -0.621203 -0.064786
C  1.649461 1.867689 0.136691
C  -5.185144 -1.306013 0.233512
C  -2.62222 2.099624 -0.091946
C  -0.687117 -1.72372 -0.246353
C  2.972145 -0.690475 -0.007301
C  0.69631 -1.79199 -0.217011
C  -0.405464 3.223587 0.121053
C  -4.887238 1.081012 -0.334933
C  3.733166 0.538863 0.125164
C  0.968003 3.146377 0.191028
C  3.049368 1.788869 0.190879
C  -5.734546 0.025412 -0.203093
C  3.695486 -1.92662 -0.073361
C  5.166585 0.488009 0.185879
C  5.090572 -1.968236 -0.014012
C  5.797259 -0.743275 0.115766
H  -3.813643 -1.885117 -1.338935
H  -5.132922 -1.31054 1.353079
H  -3.107163 3.083552 -0.105967
H  -1.272892 -2.637861 -0.363321
H  1.165045 -2.774986 -0.318811
H  -0.912908 4.194523 0.152227
H  -5.27186 2.081172 -0.56637
H  1.575016 4.054345 0.282226
H  3.636749 2.710351 0.28377
H  -6.819341 0.111402 -0.319023
H  3.154549 -2.871272 -0.170682
H  -3.052447 -2.576344 1.341317
H  5.752206 1.406597 0.285969
H  -5.630525 -3.234225 0.008363
H  5.643531 -2.910171 -0.063974
