program: Gaussian 09
title: 000187229
version: EM64L-G09RevD.01
frameworkgroup: C1[X(C24H16O2)]
method: RPBEPBE
basis: SDD
operation: Freq
keyword: #pfreq=noraman
keyword: PBEPBE/SDD
title: #p freq=noraman PBEPBE/SDD
converged: NO YES NO NO
title: Mulliken charges:
elementType: O O C C C C C C C C C C C C C C C C C C C C C C C C H H H H H H H H H H H H H H H H
charge: -0.444706 -0.443050 -0.018129 0.029293 0.282069 0.014766 -0.257008 0.509834 0.398926 0.333363 0.520658 -0.133477 -0.799863 -0.481973 0.153586 -0.475546 -0.501000 -0.387841 0.465193 -0.506056 -0.248943 -0.822477 -0.347043 -0.459523 -0.260899 -0.251371 0.277156 0.201658 0.246854 0.310196 0.224391 0.244245 0.243359 0.244772 0.256643 0.247045 0.226212 0.343585 0.246194 0.359067 0.228971 0.230867
chargesum: 0.00000
title: Mulliken charges with hydrogens summed into heavy atoms:
elementType: O O C C C C C C C C C C C C C C C C C C C C C C C C
charge: -0.101121 -0.083983 -0.018129 0.029293 0.282069 0.014766 0.020148 0.509834 0.398926 0.333363 0.520658 0.068181 -0.553009 -0.171776 0.153586 -0.251154 -0.256754 -0.144482 0.465193 -0.261283 0.007700 -0.575432 -0.120830 -0.213330 -0.031928 -0.020504
polarizability: 5.57832302e+02 -3.11719616e+01 2.98293804e+02 5.94467214e+00 3.51070551e+00 1.10536915e+02
1716.lowfreq: -9.0100 -5.4695 -0.0006 -0.0003 0.0006 5.8631 35.6250 53.1117 72.7767
frequency: 35.5973 53.1078 72.7671 91.4856 125.0735 132.6234 179.3540 204.3068 230.9729 233.7817 266.6156 276.0164 288.3317 315.0417 335.2355 338.4958 368.9808 377.9797 409.2796 413.6012 456.8217 477.2934 479.7030 494.7932 501.0943 512.1186 521.2226 532.1403 542.6875 550.2322 557.8787 562.9333 581.2745 630.2855 634.6878 654.1051 688.7494 697.8183 727.7255 757.7583 761.8586 782.2509 789.5460 798.5114 824.6052 837.0935 845.9780 859.1222 868.3746 877.1434 885.5421 921.6441 938.7334 941.2909 950.8888 963.2309 975.7847 988.1754 992.4951 1008.5098 1012.9460 1026.0730 1037.0818 1045.0923 1060.2015 1103.3732 1123.7815 1149.0701 1166.4901 1169.7736 1178.6088 1183.1765 1197.1779 1213.3391 1218.8924 1234.9054 1238.7054 1261.0330 1286.3133 1293.0648 1312.0055 1322.9297 1330.3093 1350.5700 1357.5677 1364.6225 1391.1529 1404.7726 1407.8109 1419.9100 1424.0675 1430.2655 1442.8371 1467.1169 1477.0423 1486.0748 1523.2092 1559.4679 1575.1691 1597.2856 1610.8719 1624.7809 1632.2308 1656.0890 2852.6361 3004.1668 3119.6331 3120.7640 3122.4130 3123.9837 3126.6348 3134.4686 3146.0484 3146.8600 3154.9972 3167.3811 3168.4768 3180.0956 3524.4584 3536.6208
redmass: 5.8304 4.8575 6.1612 4.2202 5.5408 5.2012 4.2194 4.4547 5.3390 4.4890 7.1081 4.3126 4.7972 4.7513 3.3573 3.2158 1.7766 3.1614 3.7547 5.2829 3.1979 4.5596 4.9243 5.1746 1.2200 3.5185 4.8798 3.5673 5.3025 5.4534 3.7791 3.6373 4.9700 3.8527 5.7820 5.0857 3.7264 4.0241 3.5293 1.3199 2.4843 2.4495 5.0273 2.3847 1.5248 3.7662 3.2993 2.3198 1.7636 2.0998 5.5963 1.9685 5.1456 2.1209 3.8498 1.4507 1.4342 1.3895 1.4539 1.3953 2.4633 3.7368 3.2688 4.3914 2.7844 2.4091 2.9540 1.7827 1.2013 1.4076 1.1314 1.2809 1.3768 1.3406 1.3748 1.3007 1.2997 1.7973 1.8883 2.2815 1.5440 2.6630 2.3836 1.2238 1.7371 2.7158 4.1548 1.8804 4.4373 2.7796 6.7685 3.9808 4.0270 3.4218 3.2919 5.6141 4.0716 6.8786 7.0173 6.3172 6.5088 6.6440 6.9015 7.6274 1.0795 1.0832 1.0902 1.0909 1.0868 1.0866 1.0881 1.0884 1.0919 1.0978 1.0918 1.0987 1.0984 1.0953 1.0649 1.0657
irintensity: 0.3200 1.0677 1.3316 0.4734 0.2896 0.7442 7.8168 0.7534 3.5525 3.2901 0.5235 0.2828 12.0305 0.5974 5.4182 5.5593 66.6774 18.9192 0.1372 0.3571 4.6074 1.6571 1.3224 2.3840 247.4500 21.6398 6.0846 3.0823 2.5075 2.1907 4.0061 20.3576 5.0688 5.5270 2.4626 0.4332 1.9632 11.4466 20.2236 76.3536 3.5621 39.1128 5.9886 0.1367 0.5392 5.1302 4.8642 3.8809 15.0897 2.6742 1.9309 22.3924 43.5453 61.3053 14.7067 17.7169 16.7851 0.2041 1.1958 1.5747 29.0468 3.2392 8.7343 115.4623 16.0771 4.2434 1.9601 16.8643 3.3891 9.3843 3.4559 15.4438 20.2219 12.5294 30.3845 57.4757 8.0186 8.0009 0.7228 1.3799 1.1070 2.0533 3.9745 37.7042 27.5690 3.6219 5.3672 8.2694 3.5148 0.2431 0.8341 1.6056 3.2301 7.9015 7.5881 2.2935 3.4667 14.0683 2.8926 1.1814 13.4080 0.7796 8.5086 3.3897 55.9733 11.1593 1.6901 7.5358 0.2677 5.8630 21.9880 9.1742 5.4039 33.3497 35.9981 43.1178 13.4799 11.0564 11.1416 4.8706
temp: 298.150 k
press: 1.00000 atm
elementType: 8 8 6 6 6 6 6 6 6 6 6 6 6 6 6 6 6 6 6 6 6 6 6 6 6 6 1 1 1 1 1 1 1 1 1 1 1 1 1 1 1 1
symmnumber: 1
zpe: 856033.6 jmol-1
zpe.correction: 0.326046 hartree
zpe.thermalcorrener: 0.344723 hartree
zpe.thermalcorrenthalpy: 0.345667 hartree
zpe.thermalcorrgfe: 0.280215 hartree
zpe.sumelectzpe: -1072.898628 hartree
zpe.sumelectthermal: -1072.879952 hartree
zpe.sumelectthermalent: -1072.879007 hartree
zpe.sumelectthermalfe: -1072.944459 hartree
dipole: 2.2516 1.2231 1.3641
dipole: 2.9029
quadrupole: -146.8730 -132.0101 -154.6491
quadrupole: -7.1627 -4.8814 -2.3623
quadrupole: -2.3622 12.5006 -10.1384 -7.1627 -4.8814 -2.3623
hfenergy: -1073.2246745 hartree
pointgroup: C01 [X(C24H16O2)]
dipole: 0.8526257 0.5165322 0.5572775 debye
polarizability: 559.9853624|-18.4701112|295.7187116|12.4704793|6.1165802|110.9589472 unknown
InChI: InChI=1S/C24H16O2/c25-20-10-7-16-12-15-6-5-14-11-13-3-1-2-4-17(13)18-8-9-19(22(15)21(14)18)23(16)24(20)26/h1-12,20,24-26H
charge 0 multiplicity 1
42 atoms
O  -3.082488 -2.770565 0.407018
O  -5.855148 -2.276048 -0.20399
C  -0.288063 0.712769 -0.030298
C  -2.553747 -0.328589 -0.142026
C  -1.12495 -0.465632 -0.13524
C  1.148435 0.595812 0.01101
C  -3.511815 -1.517695 -0.277537
C  -0.899903 2.01937 0.009453
C  -3.134178 0.977893 -0.163814
C  1.780253 -0.688755 -0.075049
C  1.962843 1.796862 0.132091
C  -4.939278 -1.22507 0.241043
C  -2.30358 2.122727 -0.08629
C  -0.452897 -1.742302 -0.255236
C  3.229274 -0.791385 -0.021173
C  0.928962 -1.840253 -0.229064
C  -0.062267 3.197577 0.124578
C  -4.590532 1.154449 -0.326671
C  4.016671 0.419531 0.111864
C  1.309476 3.089691 0.191014
C  -5.460927 0.117791 -0.194246
C  3.360666 1.684443 0.182172
C  3.928523 -2.040469 -0.091194
C  5.448636 0.331238 0.167751
C  5.324138 -2.09901 -0.034658
C  6.095232 -0.902061 0.096098
H  -3.586368 -1.833911 -1.336898
H  -4.88192 -1.230086 1.360294
H  -2.766744 3.117144 -0.097474
H  -1.058665 -2.642975 -0.374583
H  1.377806 -2.832116 -0.334982
H  -0.548403 4.179254 0.159301
H  -4.953298 2.163132 -0.5567
H  1.936489 3.984071 0.28281
H  -6.543771 0.227876 -0.308164
H  3.969867 2.592179 0.275414
H  3.368123 -2.974743 -0.188831
H  -2.820257 -2.541466 1.336642
H  6.027653 1.256811 0.268151
H  -5.423389 -3.143305 0.01801
H  5.832111 -3.06796 -0.090359
H  7.188132 -0.959222 0.139365
