program: Gaussian 09
title: 000187177
version: EM64L-G09RevD.01
frameworkgroup: C1[X(C7H14N2O4)]
method: RPBEPBE
basis: SDD
operation: Freq
keyword: #p
keyword: freq=noraman
keyword: PBEPBE/SDD
title: #p freq=noraman PBEPBE/SDD
converged: YES YES NO NO
title: Mulliken charges:
elementType: O O O O N N C C C C C C C H H H H H H H H H H H H H H
charge: -0.433057 -0.409367 -0.283449 -0.235504 -0.055598 0.043836 -0.345168 -0.386341 -0.380701 -0.403634 -0.475043 -0.326927 0.199114 0.214093 0.199860 0.245528 0.222032 0.218490 0.193470 0.241934 0.275013 0.259521 0.302082 0.217870 0.188076 0.333000 0.380872
chargesum: 0.00000
title: Mulliken charges with hydrogens summed into heavy atoms:
elementType: O O O O N N C C C C C C C
charge: -0.100057 -0.028495 -0.283449 -0.235504 -0.055598 0.043836 0.068785 0.081218 0.031259 0.113314 0.086559 0.079019 0.199114
polarizability: 1.23908423e+02 -4.90004105e-01 1.05255467e+02 5.17630890e+00 -5.18302421e+00 8.77151448e+01
1716.lowfreq: -8.6409 -2.6623 -0.0012 -0.0005 0.0001 7.5211 21.5425 29.9782 50.0071
frequency: 21.4339 29.8714 49.9731 53.9050 72.2077 98.1122 108.2601 126.8071 147.7371 169.6269 236.0918 281.7689 308.6267 330.2843 344.0718 353.5317 424.4271 465.4894 499.5775 505.7466 580.9762 639.1293 676.0788 754.0106 772.5586 797.9792 837.1308 898.0868 912.5723 952.6034 984.4738 1023.7916 1034.0271 1040.4195 1059.9869 1073.0415 1082.4187 1100.1378 1147.2586 1212.7493 1238.6409 1243.7515 1246.1769 1275.1445 1289.3876 1301.6156 1314.2705 1324.4848 1333.1833 1341.4797 1355.0644 1365.7486 1381.7772 1386.1730 1438.7991 1447.4633 1458.8263 1466.5425 1475.1584 1487.0569 1662.2387 2951.3483 2965.2513 2975.9864 2986.6204 3011.7340 3019.8513 3022.5549 3041.6372 3068.9907 3070.1225 3075.3753 3099.9130 3513.8270 3561.7525
redmass: 10.6880 7.0362 4.5707 1.8375 3.8546 3.0941 2.9683 3.4654 2.3250 6.2144 3.7067 6.4650 1.1872 3.3160 3.2348 5.2775 4.2952 4.2938 2.3858 2.8722 4.7779 1.3199 3.2128 1.0823 1.7064 1.1797 5.4843 3.8599 1.3806 4.5608 2.7770 3.3050 3.8788 3.3143 2.2908 2.3369 2.3806 1.4446 1.4144 1.9364 1.3528 1.5834 1.5189 1.4763 1.0567 1.5442 1.3427 1.5625 2.4182 1.4244 1.4515 1.5767 1.5129 1.2597 1.0832 1.0936 1.0818 1.0703 1.0871 1.0947 8.1837 1.0687 1.0622 1.0598 1.0636 1.0625 1.0966 1.0599 1.0982 1.0982 1.0993 1.1002 1.1025 1.0640 1.0663
irintensity: 0.8089 0.8550 8.6533 3.6777 4.3144 2.6372 3.8065 1.1330 1.2421 1.5813 1.4238 0.3453 139.8651 25.6825 4.8687 1.2042 27.0545 8.9016 11.3873 40.5255 25.5129 125.2144 3.0081 10.9692 15.7869 2.7755 23.6140 20.7418 41.5717 75.1591 31.7172 129.1287 71.0026 29.1087 16.9623 22.5786 124.9601 60.7096 3.6444 20.0797 20.4960 4.7393 0.6872 33.5140 3.5374 26.6669 26.3811 57.7813 68.0556 12.7031 13.6946 9.1440 38.2791 13.9981 0.5580 49.2718 7.7826 1.9835 1.9433 14.0287 219.6134 55.1226 9.9794 28.6115 61.7867 6.8988 1.5044 12.0318 26.7836 2.4130 0.9978 74.9840 7.9146 24.9912 8.0990
temp: 298.150 k
press: 1.00000 atm
elementType: 8 8 8 8 7 7 6 6 6 6 6 6 6 1 1 1 1 1 1 1 1 1 1 1 1 1 1
symmnumber: 1
zpe: 570648.2 jmol-1
zpe.correction: 0.217348 hartree
zpe.thermalcorrener: 0.232634 hartree
zpe.thermalcorrenthalpy: 0.233578 hartree
zpe.thermalcorrgfe: 0.171743 hartree
zpe.sumelectzpe: -684.422924 hartree
zpe.sumelectthermal: -684.407638 hartree
zpe.sumelectthermalent: -684.406694 hartree
zpe.sumelectthermalfe: -684.468529 hartree
dipole: 1.9611 -1.5776 -0.2227
dipole: 2.5267
quadrupole: -83.7247 -89.2405 -81.7725
quadrupole: 20.7457 -1.7836 7.7076
quadrupole: 1.1879 -4.3279 3.1401 20.7457 -1.7836 7.7076
hfenergy: -684.640272 hartree
pointgroup: C01 [X(C7H14N2O4)]
dipole: 0.7189515 -0.6432799 -0.2398085 debye
polarizability: 123.669076|-3.043855|107.0270021|4.2904599|-1.0211526|86.1829564 unknown
InChI: InChI=1S/C7H14N2O4/c10-6-2-1-4-9(8-13)5-3-7(11)12/h10-11H,1-6H2
charge 0 multiplicity 1
27 atoms
O  5.227084 -1.703579 -0.417923
O  -3.521645 -1.695941 -1.429833
O  -1.733069 2.900088 -0.008155
O  -3.281075 -1.725304 0.880787
N  -0.250625 1.339296 0.626324
N  -0.488206 2.638802 0.212085
C  1.747392 -0.030701 -0.096082
C  1.159606 1.00292 0.892537
C  3.231022 -0.331213 0.218001
C  -1.354655 0.379835 0.842828
C  -1.936758 -0.157996 -0.483998
C  3.836479 -1.363567 -0.752352
C  -2.956855 -1.248141 -0.229498
H  1.64711 0.360519 -1.127921
H  1.167064 -0.974368 -0.046911
H  1.716961 1.954181 0.826144
H  1.253275 0.621832 1.928994
H  3.334274 -0.719244 1.250294
H  3.817277 0.610722 0.167894
H  -0.976007 -0.445536 1.467606
H  -2.154781 0.898967 1.401278
H  -1.144118 -0.56944 -1.136512
H  -2.416455 0.661549 -1.048065
H  3.298803 -2.324457 -0.679083
H  3.755442 -0.999514 -1.800118
H  5.78736 -0.890942 -0.501673
H  -4.189196 -2.40907 -1.235644
