program: Gaussian 09
title: 000187165
version: EM64L-G09RevD.01
frameworkgroup: C1[X(C8H6Cl4O)]
method: RPBEPBE
basis: SDD
operation: Freq
keyword: #p
keyword: freq=noraman
keyword: PBEPBE/SDD
title: #p freq=noraman PBEPBE/SDD
converged: NO YES NO NO
title: Mulliken charges:
elementType: Cl Cl Cl Cl O C C C C C C C C H H H H H H
charge: 0.042970 0.040644 0.000107 0.043061 -0.241236 0.521403 -0.248875 -0.355214 -0.313838 -0.012101 -0.080744 -0.125383 -0.679097 0.217846 0.217662 0.284337 0.212359 0.238027 0.238073
chargesum: 0.00000
title: Mulliken charges with hydrogens summed into heavy atoms:
elementType: Cl Cl Cl Cl O C C C C C C C C
charge: 0.042970 0.040644 0.000107 0.043061 -0.241236 0.521403 0.186633 -0.355214 -0.029502 -0.012101 -0.080744 -0.125383 0.009362
polarizability: 1.81581231e+02 3.52341254e+00 1.57658762e+02 -9.42688807e-03 4.19755548e-03 5.62341088e+01
1716.lowfreq: 0.0006 0.0022 0.0026 3.1823 5.5377 7.6224 46.2504 77.3409 86.3394
frequency: 46.2477 77.3402 86.3369 106.8410 107.0903 172.3424 189.3196 197.5846 208.2269 234.1377 261.9919 283.2114 298.5621 320.0191 339.8489 344.7405 486.1788 524.3034 538.8228 597.6825 617.4606 691.1457 722.1846 775.1123 818.8056 834.9736 843.2610 949.3209 1028.4112 1053.2722 1115.2719 1133.9229 1169.4658 1244.2848 1265.6811 1327.7874 1354.8847 1375.2704 1401.1282 1419.3366 1459.9698 1476.3020 1486.9190 1541.7998 1577.3737 2965.0438 3002.0270 3027.1971 3099.0796 3113.8345 3187.5340
redmass: 5.8661 23.1549 7.0957 1.7727 3.8419 8.0727 19.3945 23.9532 34.4543 1.2634 5.9457 6.0017 4.8204 21.1416 19.8877 11.6884 6.7518 4.7267 9.4069 7.7406 11.1880 7.5003 3.9974 8.5805 1.2992 4.6997 1.3664 5.1576 3.0634 7.9177 2.1947 1.4338 1.7915 5.8310 1.1390 8.6799 2.5337 2.2029 1.3002 3.3736 1.0390 1.0655 1.0882 9.2402 8.0553 1.0554 1.0365 1.1082 1.0988 1.1017 1.0917
irintensity: 0.5934 0.2469 0.0146 3.0020 1.0391 0.1219 0.2617 0.1063 0.0022 0.9874 1.4684 3.0817 0.5317 1.1880 1.1541 1.0305 0.5155 2.3258 11.9723 3.2710 0.2866 77.7423 0.9913 23.2259 26.6806 17.4385 8.5959 48.8140 61.0250 101.8549 5.1107 5.6905 67.0702 80.7582 0.0235 163.5716 44.9889 6.4391 82.1968 141.9780 13.1276 10.7900 6.6823 32.8257 94.1037 31.5128 19.1561 29.4220 22.0442 28.7176 0.7623
temp: 298.150 k
press: 1.00000 atm
elementType: 17 17 17 17 8 6 6 6 6 6 6 6 6 1 1 1 1 1 1
symmnumber: 1
zpe: 314013.1 jmol-1
zpe.correction: 0.119601 hartree
zpe.thermalcorrener: 0.133262 hartree
zpe.thermalcorrenthalpy: 0.134207 hartree
zpe.thermalcorrgfe: 0.077714 hartree
zpe.sumelectzpe: -2222.927447 hartree
zpe.sumelectthermal: -2222.913786 hartree
zpe.sumelectthermalent: -2222.912842 hartree
zpe.sumelectthermalfe: -2222.969334 hartree
dipole: 3.7151 -2.6988 0.0051
dipole: 4.5919
quadrupole: -94.8393 -102.5051 -103.6402
quadrupole: -9.8516 0.0140 -0.0039
quadrupole: 5.4889 -2.1769 -3.3120 -9.8516 0.0140 -0.0039
hfenergy: -2223.0470484 hartree
pointgroup: C01 [X(C8H6Cl4O1)]
dipole: -1.5163072 -0.9564467 -0.2231478 debye
dipolederiv: -0.1691022 0.2639547 0.0137355 0.3024022 -0.5116513 -0.0294763 0.0176354 -0.0325184 0.0011958 -0.216497 -0.2822469 -0.046949 -0.301339 -0.450962 -0.0713529 -0.0487475 -0.0697241 -0.0096841 -0.1820632 0.2179583 0.0099264 0.2708189 -0.6410703 -0.0418014 0.0153694 -0.0460533 -0.029529 -0.6748592 0.0585132 -0.0479436 0.0522394 -0.015734 0.0015076 -0.048099 0.0020241 0.0057203 -1.9533704 -0.3279199 -0.1704469 -0.2580157 -0.33553 -0.0284642 -0.1623116 -0.0341969 -0.279251 1.5940985 0.2680653 0.143819 -0.1003303 -0.058116 -0.0303313 0.1048081 -0.0006682 0.160358 0.911018 0.2260055 0.0661049 0.6251245 0.4599766 0.0578818 0.1083912 0.0260306 0.3991214 -0.1915307 -0.4209774 -0.0513678 -0.7321268 0.6117994 0.0155203 -0.0840336 0.0405672 -0.1022734 -0.4169642 -0.0503567 -0.0253263 0.322094 -0.245701 0.0182594 0.0138443 -0.0118232 -0.1684437 0.2917242 0.3837049 0.0632644 0.4785767 0.641099 0.1044746 0.0730788 0.096708 0.0232091 0.2412572 -0.2025681 0.0007922 -0.336248 1.0242057 0.0805511 -0.0128391 0.0911468 -0.0107646 0.7794054 -0.117217 0.0539922 -0.0683364 -0.4738808 -0.0472245 0.0583736 -0.0510683 -0.070445 -0.151578 0.0168556 -0.0141311 -0.023689 0.0412726 -0.0026617 -0.0185646 0.0005822 0.0467417 -0.0419313 0.0431447 0.0822224 -0.0957357 -0.0299664 -0.0853985 0.031121 -0.0971138 -0.0874639 -0.0240526 0.0423678 -0.0661088 -0.100236 -0.0697325 0.0755204 -0.0453028 0.1095834 -0.0655186 0.0613255 -0.0463895 -0.0137887 -0.061256 0.0266019 -0.0201811 -0.0155758 -0.0187373 0.1693771 -0.0418141 -0.0935351 -0.0229489 -0.1294443 -0.0514464 -0.0287438 -0.0267868 -0.025838 0.1143956 0.0885863 0.0168578 0.022617 0.0814194 0.060207 -0.0820279 0.0594734 -0.0827953 -0.0653954 0.0963477 0.0037827 0.0025371 0.0740822 0.0186287 0.1139484 -0.0198341 0.1038946 -0.0313502 unknown
polarizability: 180.3010577|-5.8784418|157.1481506|9.3187704|10.0359525|58.0248933 unknown
InChI: InChI=1S/C8H6Cl4O/c1-2-13-5-3-4(9)6(10)8(12)7(5)11/h3H,2H2,1H3
charge 0 multiplicity 1
19 atoms
Cl -0.893055 2.812925 0.195982
Cl 2.328767 2.608796 0.432749
Cl 1.940955 -2.932016 -0.173869
Cl 3.775665 -0.268583 0.24567
O  -2.224826 0.240101 -0.17906
C  -0.852355 0.051777 -0.088878
C  -3.084841 -0.954093 -0.375443
C  -0.06127 1.22182 0.096815
C  -0.212257 -1.20684 -0.168937
C  1.34173 1.120938 0.19864
C  1.187851 -1.290577 -0.065027
C  1.984388 -0.142742 0.118004
C  -4.522993 -0.450146 -0.435841
H  -2.789948 -1.459579 -1.317229
H  -2.933012 -1.652026 0.472617
H  -0.786349 -2.124162 -0.31094
H  -5.211793 -1.301754 -0.582544
H  -4.796258 0.064444 0.500396
H  -4.654897 0.255618 -1.272806
