program: Gaussian 09
title: 000187179
version: EM64L-G09RevD.01
frameworkgroup: C1[X(C10H22N2O2)]
method: RPBEPBE
basis: SDD
operation: Freq
keyword: #p
keyword: freq=noraman
keyword: PBEPBE/SDD
title: #p freq=noraman PBEPBE/SDD
converged: YES YES NO NO
title: Mulliken charges:
elementType: O O N N C C C C C C C C C C H H H H H H H H H H H H H H H H H H H H H H
charge: -0.431597 -0.283928 -0.054969 0.044969 -0.048397 -0.451120 -0.377551 -0.397975 -0.351551 -0.340245 -0.337738 -0.355050 -0.693721 -0.691460 0.212527 0.233212 0.241728 0.213213 0.243194 0.220301 0.199487 0.208664 0.200879 0.187781 0.193931 0.212792 0.192200 0.198043 0.199713 0.212135 0.216883 0.211677 0.329916 0.219543 0.210777 0.211737
chargesum: 0.00000
title: Mulliken charges with hydrogens summed into heavy atoms:
elementType: O O N N C C C C C C C C C C
charge: -0.101681 -0.283928 -0.054969 0.044969 0.164130 0.023821 0.078856 0.021813 0.057992 0.041466 0.067255 0.042706 -0.053026 -0.049403
polarizability: 1.56882263e+02 6.00726847e+00 1.23897072e+02 -4.48910021e+00 -6.16866220e+00 1.17308306e+02
1716.lowfreq: -7.4790 -0.0010 -0.0006 -0.0006 5.0719 10.4884 17.1135 40.4436 50.4650
frequency: 15.4337 40.4087 50.4531 53.9625 75.8644 88.2662 93.6751 100.9029 127.8972 138.0212 168.6186 216.5514 231.1863 234.0544 262.6037 290.2489 318.3628 322.6035 339.2221 346.1150 381.4284 443.3947 452.7350 468.7827 535.0036 686.9501 733.5730 739.5107 760.7378 812.1695 834.8525 838.6567 863.8943 896.1140 912.8199 924.9270 953.1726 984.4527 1011.0390 1035.1988 1051.1138 1058.1817 1068.3480 1080.5144 1100.6007 1115.8096 1120.1887 1162.7661 1191.2837 1205.2647 1225.7372 1251.8629 1263.3470 1269.9002 1280.6034 1290.7719 1295.9534 1297.9269 1311.1701 1321.6386 1337.3111 1339.2639 1354.8421 1357.0301 1360.3337 1369.2676 1372.8069 1390.1410 1392.5867 1437.5303 1449.1185 1457.5342 1466.5259 1471.3745 1475.4322 1477.3125 1478.0388 1481.2667 1487.2205 1489.2429 2956.7372 2965.0684 2968.0255 2969.5376 2974.0689 2974.2989 2976.8649 2981.4013 2984.5126 2997.8986 3019.4359 3022.5394 3037.2176 3041.7537 3050.6403 3065.8527 3069.9466 3071.4271 3072.4166 3074.0275 3074.6159 3538.6842
redmass: 3.6355 3.0035 1.8555 2.8288 3.3694 2.4179 3.6422 2.5079 2.0891 2.6755 3.7634 3.2390 1.1103 1.2231 4.5187 3.0194 1.6357 3.2710 3.4783 2.0821 3.0777 3.8808 2.0570 3.2807 4.0862 4.5760 1.0715 1.1583 1.1313 2.1999 1.8464 1.4647 2.2141 1.9166 1.9816 2.1249 1.5457 2.3931 3.4411 2.0677 2.8431 1.5564 2.3514 2.4488 2.0323 2.3035 2.2537 1.8328 1.9969 1.5199 1.6315 1.3470 1.2974 1.7523 1.2774 1.0518 1.2385 1.1199 1.5403 1.7736 1.6573 1.4186 1.5700 1.2677 1.4547 1.4620 1.4387 1.2149 1.2161 1.1035 1.0897 1.0802 1.0681 1.0712 1.0522 1.0423 1.0444 1.0713 1.0808 1.0910 1.0589 1.0644 1.0640 1.0596 1.0364 1.0360 1.0618 1.0598 1.0601 1.0983 1.0937 1.1019 1.0906 1.1004 1.0953 1.1004 1.1012 1.1010 1.1004 1.0994 1.0993 1.0658
irintensity: 0.1882 0.6794 0.1058 2.8026 1.7081 0.3076 4.6729 0.8146 0.1700 0.2336 2.7011 0.9836 0.0035 0.1030 1.8942 10.1012 74.3785 7.2172 8.6776 48.0037 5.2606 10.0712 4.6923 9.1559 14.3946 2.1490 11.0240 3.9316 1.2214 14.3017 8.5313 6.1687 31.3973 11.6876 13.3621 70.7247 37.2670 57.9698 6.6239 31.9175 22.2002 36.2979 15.7332 2.2789 1.1614 9.5861 14.0308 1.2526 10.3336 6.1104 14.2422 3.2398 8.6751 11.6058 8.9371 1.0744 1.9858 3.4449 29.6400 57.6896 38.5402 5.5057 1.9023 7.5964 6.9673 31.2239 10.0616 12.5226 7.7704 18.3516 6.1237 6.8408 0.6602 1.3941 2.6745 12.2677 12.5796 4.7057 15.4025 21.4500 5.8422 3.4693 23.7843 24.1057 52.5743 27.3323 34.5696 86.1933 20.4959 1.5705 0.8364 6.4519 8.4569 30.0834 24.8392 11.6671 4.5320 123.1953 80.5559 47.7144 54.8731 5.8371
temp: 298.150 k
press: 1.00000 atm
elementType: 8 8 7 7 6 6 6 6 6 6 6 6 6 6 1 1 1 1 1 1 1 1 1 1 1 1 1 1 1 1 1 1 1 1 1 1
symmnumber: 1
zpe: 825889.8 jmol-1
zpe.correction: 0.314565 hartree
zpe.thermalcorrener: 0.332582 hartree
zpe.thermalcorrenthalpy: 0.333526 hartree
zpe.thermalcorrgfe: 0.266357 hartree
zpe.sumelectzpe: -652.974819 hartree
zpe.sumelectthermal: -652.956803 hartree
zpe.sumelectthermalent: -652.955858 hartree
zpe.sumelectthermalfe: -653.023027 hartree
dipole: -2.3686 -1.4177 1.3362
dipole: 3.0669
quadrupole: -82.5069 -96.8362 -93.9261
quadrupole: -4.8439 4.0258 10.3574
quadrupole: 8.5828 -5.7465 -2.8363 -4.8439 4.0258 10.3574
hfenergy: -653.289384 hartree
pointgroup: C01 [X(C10H22N2O2)]
dipole: -0.8211002 -0.6708464 0.5758927 debye
polarizability: 154.3314729|7.8178551|126.0988631|-8.3057368|-6.6997924|117.6573053 unknown
InChI: InChI=1S/C10H22N2O2/c1-3-5-6-8-12(11-14)9-10(13)7-4-2/h10,13H,3-9H2,1-2H3
charge 0 multiplicity 1
36 atoms
O  2.507916 -0.801744 1.992289
O  1.700346 2.665706 -0.924619
N  0.103161 1.540962 0.210131
N  0.440532 2.416041 -0.817762
C  1.692816 -0.374521 0.834105
C  1.10219 1.027567 1.169636
C  -1.348552 1.34425 0.395012
C  2.491891 -0.426191 -0.481207
C  -1.824718 -0.11851 0.254921
C  -3.361889 -0.220778 0.381658
C  2.953311 -1.854459 -0.848516
C  -3.881831 -1.672196 0.264063
C  3.836631 -1.87951 -2.114162
C  -5.417285 -1.768894 0.39101
H  0.881538 -1.124051 0.810779
H  1.929236 1.765765 1.193613
H  0.631233 0.972086 2.167286
H  -1.640708 1.731018 1.393238
H  -1.834954 1.976759 -0.369191
H  1.871174 -0.014256 -1.299914
H  3.367453 0.252573 -0.400121
H  -1.501361 -0.517186 -0.726717
H  -1.355672 -0.75012 1.035328
H  -3.6831 0.202243 1.356656
H  -3.839686 0.402922 -0.402179
H  3.503059 -2.293003 0.006695
H  2.061112 -2.495064 -1.004612
H  -3.404476 -2.295505 1.047372
H  -3.561796 -2.095932 -0.709407
H  3.298228 -1.461946 -2.985835
H  4.146704 -2.909544 -2.368556
H  4.752908 -1.276608 -1.96968
H  3.360344 -0.293948 1.97743
H  -5.764094 -2.814572 0.302767
H  -5.760308 -1.380724 1.36856
H  -5.918954 -1.178725 -0.398868
