program: Gaussian 09
title: 000187191
version: EM64L-G09RevD.01
frameworkgroup: C1[X(C13H25BrN2O3)]
method: RPBEPBE
basis: SDD
operation: Freq
keyword: #p
keyword: freq=noraman
keyword: PBEPBE/SDD
title: #p freq=noraman PBEPBE/SDD
converged: YES YES NO NO
title: Mulliken charges:
elementType: Br O O O N N C C C C C C C C C C C C C H H H H H H H H H H H H H H H H H H H H H H H H H
charge: -0.056249 -0.330495 -0.298331 -0.345810 -0.393912 -0.374596 -0.370432 -0.365729 0.335612 -0.539998 -0.304182 0.236886 -0.708609 -0.699191 -0.709038 -0.328940 -0.398504 -0.692749 0.358791 0.233743 0.197586 0.222925 0.185097 0.236200 0.210623 0.231294 0.219366 0.220952 0.212150 0.267063 0.207136 0.227810 0.228583 0.221364 0.213684 0.264194 0.255451 0.221427 0.245441 0.216067 0.365872 0.274779 0.279482 0.327187
chargesum: 0.00000
title: Mulliken charges with hydrogens summed into heavy atoms:
elementType: Br O O O N N C C C C C C C C C C C C C
charge: -0.056249 -0.330495 -0.298331 -0.345810 -0.028040 -0.047409 0.060897 0.042293 0.335612 -0.093174 0.146477 0.236886 -0.008443 -0.035663 -0.009796 0.147937 0.063004 -0.138488 0.358791
polarizability: 2.40478917e+02 7.42373853e+00 1.56006267e+02 5.49742262e-02 -7.63047037e+00 1.55865574e+02
1716.lowfreq: -16.7766 -0.0005 0.0001 0.0007 1.5572 3.8204 5.2312 11.6114 21.3819
frequency: -12.0355 9.0508 21.3721 35.3721 42.6857 52.3881 72.1644 81.8011 94.2294 100.2487 118.0109 124.6723 130.5423 150.7240 168.3096 191.1652 207.9466 225.7758 242.2803 248.4373 264.6900 297.1639 313.9217 317.9997 328.1613 334.9997 396.3315 407.4495 430.4652 450.8697 478.2235 510.2618 545.6435 562.9093 609.3609 657.7435 676.8311 707.7684 729.0680 740.7097 771.9465 798.6086 810.9683 824.2258 852.0388 861.2344 908.3004 913.1793 918.9671 951.2244 951.8950 974.5843 1008.2250 1026.9779 1031.6094 1032.7070 1035.4207 1064.1725 1067.6485 1077.6107 1097.1161 1122.4544 1138.4635 1164.5653 1183.5182 1217.2924 1221.9074 1238.7434 1241.3553 1253.9714 1255.9677 1272.8488 1282.2820 1285.4276 1294.4445 1297.6113 1331.3746 1341.7176 1353.7204 1356.4243 1364.3977 1374.3586 1377.3709 1400.3399 1443.6179 1444.9146 1447.5722 1448.3674 1453.7186 1465.6882 1466.3753 1467.1049 1469.9958 1470.4022 1478.1674 1481.1990 1488.2444 1501.2952 1507.5191 1608.6725 1634.6143 2963.8654 2974.1518 2975.9949 2988.7675 2990.3212 2991.1351 2996.6222 2998.3336 3000.7872 3016.8585 3033.2672 3046.6134 3051.8152 3053.2092 3066.0248 3074.0693 3082.0632 3085.2535 3097.2391 3098.9000 3113.6306 3117.6930 3132.2957 3395.3234 3569.4428
redmass: 3.4638 6.8011 5.6230 2.4807 4.2613 3.5505 4.2789 4.9215 3.2839 4.2480 3.1945 2.8082 3.0235 3.0447 1.1856 2.9123 3.4947 1.0731 1.1771 2.8908 3.2019 2.9972 3.4325 3.6865 2.6472 3.1695 2.4093 2.7837 2.8454 2.6910 3.5867 2.5110 1.1638 3.4609 4.9733 2.3150 5.1228 10.5117 4.1789 1.1527 1.3707 1.1193 2.8789 2.6262 2.4209 2.1428 1.6251 1.5965 1.6330 3.6752 1.2073 2.7546 2.9905 1.4188 1.4114 1.5972 2.4392 2.5746 2.7166 1.9963 1.8387 3.8925 2.6134 2.0906 1.2697 1.4578 1.3087 1.3714 1.4048 1.6448 3.0072 2.8431 1.2503 1.1805 1.3287 1.0959 1.3664 1.3105 1.5203 1.4488 1.4299 1.2344 1.2361 1.2176 1.0976 1.0481 1.1655 1.1019 1.0860 1.0496 1.0560 1.0765 1.0694 1.1186 1.0527 1.1020 1.5625 1.0856 1.9101 6.0073 5.4802 1.0597 1.0650 1.0601 1.0624 1.0361 1.0357 1.0367 1.0610 1.0621 1.0961 1.1009 1.0564 1.0975 1.1023 1.1040 1.1011 1.0995 1.0992 1.0994 1.1002 1.1002 1.0994 1.1112 1.0814 1.0776
irintensity: 0.1313 0.1655 0.1568 1.5525 1.6963 0.2347 7.0300 6.4583 0.6054 4.2586 3.9718 1.0736 1.2712 1.2008 0.1200 1.1808 2.8616 0.2362 1.5026 9.2573 8.4538 15.5193 2.0420 28.1040 2.7041 3.5002 2.6423 3.6463 4.1003 2.0680 1.5116 0.4020 104.4244 4.3719 42.6944 4.4066 1.4548 20.6048 5.3590 15.7919 4.0570 97.7446 5.7011 24.8638 18.7084 2.3688 5.3458 0.9399 1.1731 17.8688 0.2343 134.0543 12.5764 0.0435 3.8869 0.9912 13.9152 3.4579 12.3904 3.5438 10.0787 96.6850 44.5862 404.8921 10.4664 70.2793 97.4856 2.0947 34.4731 17.3868 25.6828 24.1539 53.4821 10.8333 63.8287 9.7510 4.8118 4.0403 19.4735 25.1226 6.9668 41.8756 36.1207 29.9165 15.6631 1.5058 59.7837 5.1328 12.4053 6.1442 2.7978 2.6485 24.2826 87.4394 4.7361 10.6816 244.9019 83.9192 404.6670 138.5550 143.9274 18.4731 54.5649 24.2103 28.2322 21.1717 12.7371 29.8589 26.8488 33.9898 9.2699 23.6407 26.1138 12.0805 3.2342 58.4094 26.7387 9.1270 14.7170 49.5927 34.3813 4.1618 20.5147 18.2474 399.1419 39.2692
temp: 298.150 k
press: 1.00000 atm
elementType: 35 8 8 8 7 7 6 6 6 6 6 6 6 6 6 6 6 6 6 1 1 1 1 1 1 1 1 1 1 1 1 1 1 1 1 1 1 1 1 1 1 1 1 1
symmnumber: 1
zpe: 978653.6 jmol-1
zpe.correction: 0.372749 hartree
zpe.thermalcorrener: 0.395487 hartree
zpe.thermalcorrenthalpy: 0.396431 hartree
zpe.thermalcorrgfe: 0.316444 hartree
zpe.sumelectzpe: -857.530055 hartree
zpe.sumelectthermal: -857.507317 hartree
zpe.sumelectthermalent: -857.506373 hartree
zpe.sumelectthermalfe: -857.586360 hartree
dipole: -8.2683 -2.0663 -0.8545
dipole: 8.5653
quadrupole: -132.4258 -135.8219 -115.3083
quadrupole: 1.8298 6.7200 -4.6846
quadrupole: -4.5739 -7.9699 12.5437 1.8298 6.7200 -4.6846
hfenergy: -857.902804 hartree
pointgroup: C01 [X(C13H25Br1N2O3)]
dipole: 3.1721765 1.1287462 0.1384108 debye
polarizability: 235.6786366|14.9123561|160.6252449|13.1514216|10.0654571|156.0468764 unknown
InChI: InChI=1S/C13H25BrN2O3/c1-13(2,3)19-12(18)16-10-9-15-11(17)7-5-4-6-8-14/h15-16H,4-10H2,1-3H3
charge 0 multiplicity 1
44 atoms
Br -7.75192 0.415118 -2.06524
O  3.92507 1.066503 -0.150617
O  -1.751522 -3.047057 0.118531
O  1.635763 0.80687 0.414814
N  -0.051888 -1.46001 0.267023
N  2.693477 -0.493139 -1.225159
C  -3.606979 -1.090904 1.264844
C  -3.931188 -0.3493 -0.052448
C  4.199033 2.159479 0.880757
C  -2.097506 -1.105197 1.59391
C  -5.453045 -0.343763 -0.352037
C  -1.298246 -1.955443 0.594075
C  3.327766 3.389514 0.558756
C  5.691961 2.444488 0.644226
C  3.94558 1.603975 2.29606
C  0.845166 -2.166117 -0.655899
C  1.494377 -1.218569 -1.694198
C  -5.749981 0.378942 -1.665881
C  2.661441 0.488852 -0.260841
H  -3.951857 -2.139014 1.186095
H  -4.158163 -0.61977 2.10275
H  -3.390446 -0.843279 -0.884031
H  -3.556985 0.694257 0.00646
H  -1.950187 -1.553895 2.596865
H  -1.692824 -0.075081 1.639945
H  -5.821778 -1.385065 -0.407636
H  -5.996025 0.149822 0.476386
H  3.498216 3.721881 -0.480597
H  3.601977 4.220072 1.234498
H  2.25858 3.162729 0.693172
H  6.034087 3.240539 1.329209
H  6.295724 1.539157 0.828107
H  5.865417 2.775688 -0.394043
H  4.533526 0.683795 2.461702
H  4.262666 2.352694 3.044748
H  2.877888 1.382619 2.449387
H  0.228308 -2.924634 -1.172129
H  1.643417 -2.705174 -0.106274
H  0.730254 -0.498143 -2.044178
H  1.817243 -1.817545 -2.563819
H  0.278581 -0.547306 0.614343
H  -5.457602 1.440732 -1.646049
H  -5.30674 -0.124874 -2.539016
H  3.59186 -0.655844 -1.680772
