program: Gaussian 09
title: 000184915
version: EM64L-G09RevD.01
frameworkgroup: C1[X(C13H8Cl4O)]
method: RPBEPBE
basis: SDD
operation: Freq
keyword: #p
keyword: freq=noraman
keyword: PBEPBE/SDD
title: #p freq=noraman PBEPBE/SDD
converged: YES YES NO NO
title: Mulliken charges:
elementType: Cl Cl Cl Cl O C C C C C C C C C C C C C H H H H H H H H
charge: 0.020544 0.039320 0.001666 0.050673 -0.261158 0.320821 0.544977 -0.364231 -0.368599 -0.387164 -0.407368 0.325052 -0.354199 -0.359333 -0.049080 -0.093710 -0.109598 -0.537578 0.255422 0.249687 0.287185 0.244327 0.254864 0.225158 0.223412 0.248909
chargesum: 0.00000
title: Mulliken charges with hydrogens summed into heavy atoms:
elementType: Cl Cl Cl Cl O C C C C C C C C C C C C C
charge: 0.020544 0.039320 0.001666 0.050673 -0.261158 0.320821 0.544977 -0.108808 -0.118912 -0.387164 -0.120183 0.325052 -0.109872 -0.104469 -0.049080 -0.093710 -0.109598 0.159901
polarizability: 3.13804345e+02 6.04994629e+00 1.87004362e+02 4.53484248e-01 1.15727861e+01 9.17741295e+01
1716.lowfreq: -3.2510 -2.3139 0.0014 0.0023 0.0027 6.6074 35.6332 47.1443 52.0249
frequency: 35.6297 47.1417 51.9982 76.0472 95.9212 109.0233 165.2487 169.4899 196.9142 199.7467 216.2504 231.8439 240.5078 255.2282 280.6959 316.9358 333.7584 338.6103 384.9457 417.0800 445.5318 504.6642 506.7393 539.3002 551.7953 584.0185 614.0829 632.0226 643.6651 725.3366 739.1430 755.0711 779.1834 818.9879 831.3304 836.4870 883.0815 949.9893 964.7333 984.9649 996.3656 1015.6645 1094.5947 1113.6789 1117.6800 1158.4102 1176.6130 1183.9183 1239.7541 1270.3606 1295.0712 1315.9419 1346.3001 1368.7532 1402.9539 1424.1632 1439.0059 1470.0913 1471.8697 1505.4643 1520.9904 1569.5154 1573.7036 1621.8973 2964.4586 3054.5064 3129.8575 3135.8420 3151.6597 3170.5236 3172.9634 3174.3765
redmass: 8.2635 7.0354 4.7556 26.4753 8.6031 3.8950 4.7400 8.7217 6.0465 14.4921 21.5751 11.8462 1.4623 3.8992 5.1051 25.6651 7.8981 12.8750 7.8284 3.0031 5.3879 4.1892 5.4635 5.1663 8.0907 4.0300 7.4214 8.6961 7.9328 5.1597 4.5380 6.8014 8.7911 1.2948 6.1654 1.6801 1.4760 1.3405 1.3495 8.4639 4.0882 4.4653 4.8721 1.2596 1.3706 1.3245 1.9297 1.2938 2.6672 4.8827 1.9133 2.1032 9.2980 5.6005 3.7287 3.8798 1.1865 1.0495 1.0691 2.7237 9.2754 8.0763 7.2611 6.3423 1.0328 1.1042 1.0997 1.0893 1.0876 1.0952 1.0925 1.0962
irintensity: 0.2463 0.4798 1.0342 0.1326 0.5475 3.4470 3.1971 0.8209 0.9702 0.6134 0.0914 0.0869 0.7277 1.8958 1.1025 0.1933 0.5854 0.4563 1.8473 1.5904 4.6290 18.3747 20.5113 0.9215 28.7629 18.0269 2.2603 23.6859 4.8353 0.2607 0.5948 17.4467 45.5795 10.4789 3.2248 60.4393 9.4439 0.8065 0.4446 49.1099 4.8154 26.3904 17.6761 0.2322 8.3890 1.9716 40.4427 151.8931 187.8049 15.1392 36.4253 22.1657 12.8194 30.0967 171.0040 31.3513 5.6611 14.6860 49.2730 85.7212 24.5108 31.7432 9.1239 129.9945 72.3423 44.4718 25.4999 8.4173 8.7603 9.3960 0.1365 4.5706
temp: 298.150 k
press: 1.00000 atm
elementType: 17 17 17 17 8 6 6 6 6 6 6 6 6 6 6 6 6 6 1 1 1 1 1 1 1 1
symmnumber: 1
zpe: 449198.3 jmol-1
zpe.correction: 0.171091 hartree
zpe.thermalcorrener: 0.188084 hartree
zpe.thermalcorrenthalpy: 0.189028 hartree
zpe.thermalcorrgfe: 0.124591 hartree
zpe.sumelectzpe: -2414.350983 hartree
zpe.sumelectthermal: -2414.333990 hartree
zpe.sumelectthermalent: -2414.333045 hartree
zpe.sumelectthermalfe: -2414.397482 hartree
dipole: -4.3662 -0.0598 -1.1966
dipole: 4.5276
quadrupole: -117.3117 -132.5240 -130.2085
quadrupole: 5.1822 8.0971 4.4371
quadrupole: 9.3697 -5.8426 -3.5271 5.1822 8.0971 4.4371
hfenergy: -2414.5220731 hartree
pointgroup: C01 [X(C13H8Cl4O1)]
dipole: 1.7084608 -0.1684543 -0.4751993 debye
dipolederiv: -0.1896858 -0.2329369 0.0580118 -0.2334323 -0.5018519 0.1454994 0.0830753 0.141232 -0.054058 -0.261477 0.2724285 -0.104122 0.3361584 -0.4119863 0.1576979 -0.1248371 0.1615207 -0.0609215 -0.2364525 -0.2309111 0.0857547 -0.335144 -0.5580472 0.1975623 0.1125771 0.1983558 -0.0980926 -0.8037026 -0.0559615 0.0067597 -0.0427141 -0.0066124 0.0046634 -0.0135404 0.0106871 0.0060296 -2.1070914 -0.0150676 0.2708734 0.0315822 -0.2961351 0.0054938 0.1590247 0.0070294 -0.343032 -0.2585281 -0.029309 0.0553322 0.070064 -0.0958369 0.0244533 -0.0161523 0.0572785 -0.1312312 0.803607 -0.1061567 0.0128323 -0.103456 -0.055667 0.0515588 -0.0062319 0.0355208 0.0000728 0.2314413 0.0098206 -0.0664488 0.1274258 -0.0611997 -0.0839321 -0.0916164 -0.0527466 0.088215 0.2336144 -0.0374958 0.0201489 -0.2145538 -0.0884607 -0.0737049 0.120383 -0.0729769 0.0847925 -0.0919411 0.4015445 -0.0998179 0.5286883 0.5952633 -0.1629755 -0.203475 -0.1831867 -0.0250951 -0.3688994 -0.0545467 0.0227411 -0.1965248 -0.1823969 0.0487392 0.0931273 0.0375579 -0.1213279 1.8628681 -0.0405357 -0.1198843 -0.1520482 0.1019648 0.0284114 0.1599356 0.0144075 0.0561923 -0.4972009 0.012695 0.0108174 0.1523916 -0.1764644 -0.0657707 -0.3979101 -0.0427153 -0.0390743 -0.5462913 0.0098264 0.0366161 -0.103293 -0.1399372 -0.0613813 0.3636951 -0.0855671 -0.0023928 0.2120015 -0.4425026 0.1549997 -0.5859082 0.5056621 -0.2145964 0.1752745 -0.2065093 0.0880388 0.2242755 0.3562345 -0.1419256 0.461813 0.8381973 -0.3261896 -0.0955733 -0.3271599 0.093537 0.9016012 0.0637145 0.0032355 0.0887112 -0.2995413 0.0921882 0.0021231 0.0912952 -0.084044 0.71912 0.0417772 -0.1577564 0.2110926 0.3157239 -0.0252569 -0.5740492 -0.0036307 0.4091449 0.0712125 0.0232205 -0.0693119 0.0162366 0.1052151 0.0624367 -0.0876484 0.0454545 0.0035598 0.0440698 -0.033311 0.0988707 -0.0249305 0.1185109 0.0522604 0.1018771 0.0377028 0.0008846 0.0707714 0.0438064 -0.0191042 0.0593917 0.0430057 0.0307308 -0.0210101 0.0421734 0.1338791 -0.0015419 -0.0186807 0.0819293 -0.0458542 0.1416289 0.0604111 0.0982961 0.0562872 0.0001491 0.0364335 0.0288032 -0.0616824 0.045288 0.1422775 0.0615 -0.0637261 0.0625346 0.0124812 0.061422 0.0689026 -0.0001334 -0.071654 -0.1464314 0.0645832 0.1473511 0.0475252 0.0228799 0.051291 -0.055822 -0.0587972 -0.0581852 -0.003106 -0.0921569 0.1433692 -0.091221 -0.1232536 -0.1609172 0.0204635 -0.0199387 0.0388551 0.1162248 0.0177742 -0.0643388 0.0191507 0.0826665 unknown
polarizability: 313.5837651|4.6433057|162.4858507|-6.9609722|-43.3357367|116.5132209 unknown
InChI: InChI=1S/C13H8Cl4O/c1-18-8-4-2-7(3-5-8)9-6-10(14)12(16)13(17)11(9)15/h2-6H,1H3
charge 0 multiplicity 1
26 atoms
Cl -0.601086 2.586202 -0.883517
Cl -3.783411 2.393512 -0.970505
Cl -3.519485 -2.810151 1.030004
Cl -5.289231 -0.278313 -0.00053
O  5.097002 -0.417565 0.264703
C  0.869555 -0.103412 0.047467
C  -0.620973 -0.076131 0.021214
C  1.654177 0.294323 -1.064151
C  1.54339 -0.604684 1.198028
C  -1.404218 1.031105 -0.409949
C  -1.321066 -1.231825 0.460285
C  3.711353 -0.288763 0.120037
C  3.061507 0.204035 -1.03988
C  2.943639 -0.693328 1.241676
C  -2.819308 0.974414 -0.420033
C  -2.722887 -1.288927 0.461827
C  -3.493332 -0.193532 0.015151
C  5.942625 -0.001034 -0.858712
H  1.164468 0.662645 -1.970531
H  0.962367 -0.900646 2.07896
H  -0.75026 -2.109218 0.775012
H  3.631577 0.512044 -1.92101
H  3.464252 -1.062978 2.129791
H  5.80532 1.073423 -1.086977
H  5.735335 -0.60475 -1.763276
H  6.973792 -0.180247 -0.521782
