program: Gaussian 09
title: 000187222
version: EM64L-G09RevD.01
frameworkgroup: C1[X(C16H17N5O8S)]
method: RPBEPBE
basis: SDD
operation: Freq
keyword: #p
keyword: freq=noraman
keyword: PBEPBE/SDD
title: #p freq=noraman PBEPBE/SDD
converged: YES YES NO NO
title: Mulliken charges:
elementType: S O O O O O O O O N N N N N C C C C C C C C C C C C C C C C H H H H H H H H H H H H H H H H H
charge: 0.991315 -0.301039 -0.437188 -0.447539 -0.463363 -0.209275 -0.573432 -0.503106 -0.501195 -0.263273 -0.023916 -0.434693 -0.038282 -0.628838 -0.082864 -0.127534 -0.257337 -0.023052 -0.367067 0.327551 0.071913 -0.176106 0.320177 -0.011059 0.112926 -0.350564 -0.278313 -0.243938 -0.273887 -0.074124 0.302686 0.280813 0.244970 0.283663 0.215787 0.233202 0.373404 0.375765 0.404392 0.369378 0.300792 0.259572 0.285701 0.288201 0.318017 0.349780 0.380978
chargesum: 0.00000
title: Mulliken charges with hydrogens summed into heavy atoms:
elementType: S O O O O O O O O N N N N N C C C C C C C C C C C C C C C C
charge: 0.991315 -0.301039 -0.063784 -0.071773 -0.093985 -0.209275 -0.192455 -0.503106 -0.501195 -0.263273 -0.023916 -0.030300 -0.038282 0.038959 0.219822 0.153280 -0.012367 0.260611 0.081922 0.327551 0.071913 -0.176106 0.320177 -0.011059 0.112926 -0.049772 -0.018740 0.041763 0.014313 -0.074124
polarizability: 4.70681783e+02 -2.99072937e+01 2.61379738e+02 -7.44005718e+00 -2.84087340e+01 1.67845916e+02
1716.lowfreq: -4.9098 -2.5587 0.0009 0.0011 0.0014 7.9210 17.7167 24.6527 34.2634
frequency: 17.6837 24.5036 34.2515 38.8393 47.8336 52.9170 63.8378 84.4710 92.8869 112.3196 125.4749 132.7785 156.5355 158.8047 169.9317 182.6365 189.5473 196.9261 213.6915 241.3181 249.3428 253.0574 264.7080 284.2304 287.9288 294.0236 304.4479 311.6537 318.7055 329.9412 350.5253 355.2721 368.7825 375.5827 388.4645 412.6450 428.8655 441.4936 482.2872 509.0668 513.4271 521.1400 541.4805 554.1448 560.2636 565.8886 568.2097 616.8509 641.4505 648.8521 667.7392 676.3237 688.4073 695.3254 710.2209 733.8478 753.4119 764.4295 775.5803 796.2573 817.4630 832.7051 836.6412 852.2631 862.0374 867.5837 933.5246 954.4238 967.2067 969.6235 972.1690 987.0186 989.5641 998.8384 1001.0741 1007.5562 1025.6703 1042.0448 1045.0906 1048.3939 1059.9474 1073.5744 1091.3244 1098.5380 1122.6138 1161.0625 1179.2777 1194.7768 1195.2185 1207.4849 1235.6357 1250.3054 1252.9256 1266.2148 1272.3169 1284.9320 1296.8357 1301.9349 1319.0071 1327.5260 1338.5613 1345.8854 1359.6429 1367.2378 1395.1831 1396.9270 1406.6095 1420.9342 1436.3028 1470.9665 1498.0268 1517.7321 1524.3910 1579.8204 1592.0503 1599.7761 1614.0265 1636.6625 2955.1755 3012.7749 3013.5123 3042.0490 3062.3721 3070.0293 3160.0998 3161.7956 3177.8595 3183.0011 3399.5574 3435.0426 3481.3843 3530.8089 3566.4858 3582.6024 3683.1116
redmass: 7.7235 7.6626 5.4120 5.6003 6.6862 5.7547 5.9690 6.4694 6.3312 5.0907 5.7299 8.9748 7.0794 5.8630 1.6108 5.7343 4.2550 7.0139 5.6223 2.9707 1.4432 4.5286 3.9832 4.2498 4.3915 5.6344 3.9737 3.0383 8.1907 4.7821 5.6559 6.0354 6.7731 3.5507 6.7690 3.0502 1.1840 8.7710 5.6932 4.7039 2.8868 8.5375 5.1600 1.3548 2.6718 2.3898 2.2648 7.0114 6.8788 10.5501 5.1960 7.0834 5.5506 7.7478 6.7998 3.6549 6.2923 1.7822 5.6786 3.4897 3.8682 4.2814 1.7389 4.5574 1.4669 3.4728 3.4101 6.0696 14.5833 1.5045 4.8005 4.6920 2.7936 1.3744 3.1301 2.6078 4.3193 4.5777 1.4482 2.5227 2.2483 2.8483 4.0918 2.7002 1.4041 3.3243 1.1619 1.1399 1.1476 1.1133 4.4126 2.6817 1.4890 1.5149 1.5398 1.4712 1.3028 1.2820 1.4371 1.2923 1.2363 3.9083 1.4906 5.4729 2.0009 2.7240 3.9018 1.4646 2.8392 1.0918 4.4852 3.6083 6.3154 7.3096 5.2198 1.6407 8.0884 3.4521 1.0560 1.0967 1.0945 1.0875 1.0871 1.0885 1.0893 1.0893 1.0965 1.0957 1.0803 1.0648 1.0661 1.0452 1.0664 1.0669 1.1042
irintensity: 1.0593 0.9948 0.5752 20.9090 7.4212 1.8423 4.9671 5.9040 0.2638 2.6376 4.4809 4.6764 9.9308 0.7347 43.4333 3.2662 8.0518 1.6389 1.4502 29.9274 333.0252 15.7147 97.2447 26.4333 31.5660 11.0603 12.9215 22.8721 8.7269 9.0127 18.7361 6.1084 5.2131 8.4601 5.2851 3.8558 24.0766 53.0924 17.6705 48.7693 9.7611 21.6039 35.9703 86.7711 182.4044 155.4096 86.8562 0.5206 4.9571 8.6850 10.4240 7.2463 20.7264 17.1114 41.6391 0.9158 14.7234 120.0611 2.1820 6.2013 70.7716 99.4191 34.6496 18.4168 46.0119 28.3944 71.0588 10.6731 83.3478 6.4347 53.9202 3.3568 48.6095 1.0395 101.8029 58.3199 15.3762 85.5285 15.4740 152.0274 60.4631 31.7522 12.3337 3.3240 9.5199 17.2372 38.4234 30.4989 12.5345 20.5347 74.7232 10.6880 12.8656 13.0280 4.8391 15.1272 0.7915 4.2411 35.0317 19.6614 52.7444 96.4756 29.2953 37.8917 150.2469 271.4517 46.8977 0.8453 17.9239 11.9874 67.5069 86.7435 278.0926 3.6009 176.8027 13.6897 646.1536 394.4539 31.1411 24.4216 21.6497 29.9961 13.2814 18.2539 2.6334 2.4693 0.5895 6.7560 295.2388 74.8014 41.0916 127.3865 18.9721 29.0472 45.9243
temp: 298.150 k
press: 1.00000 atm
elementType: 16 8 8 8 8 8 8 8 8 7 7 7 7 7 6 6 6 6 6 6 6 6 6 6 6 6 6 6 6 6 1 1 1 1 1 1 1 1 1 1 1 1 1 1 1 1 1
symmnumber: 1
zpe: 882618.0 jmol-1
zpe.correction: 0.336171 hartree
zpe.thermalcorrener: 0.364765 hartree
zpe.thermalcorrenthalpy: 0.365710 hartree
zpe.thermalcorrgfe: 0.275831 hartree
zpe.sumelectzpe: -1891.105305 hartree
zpe.sumelectthermal: -1891.076711 hartree
zpe.sumelectthermalent: -1891.075767 hartree
zpe.sumelectthermalfe: -1891.165645 hartree
dipole: 7.7398 11.9299 2.7347
dipole: 14.4812
quadrupole: -182.8094 -216.6371 -175.2873
quadrupole: 16.9904 -14.3932 23.3431
quadrupole: 8.7685 -25.0591 16.2906 16.9904 -14.3932 23.3431
hfenergy: -1891.4414766 hartree
pointgroup: C01 [X(C16H17N5O8S1)]
dipole: 3.0227604 4.8019338 -0.5138887 debye
polarizability: 469.5360878|-34.2893651|238.2576117|-17.3691784|-47.1871807|192.1137377 unknown
InChI: InChI=1S/C16H17N5O8S/c17-16-19-13-9(14(25)20-16)18-12(6-1-3-7(4-2-6)30(26,27)28)21(13)15-11(24)10(23)8(5-22)29-15/h1-4,8,10-11,15,19,22-24,26H,5,17H2
charge 0 multiplicity 1
47 atoms
S  -6.137475 -0.160365 0.417041
O  2.194846 1.535798 -1.565281
O  -0.538656 2.991719 -1.554983
O  1.009271 4.475824 0.027075
O  4.828886 1.94132 -0.766165
O  2.734398 -3.788477 2.017461
O  -6.1064 1.37919 1.470328
O  -6.715547 0.233545 -1.042297
O  -6.818048 -1.347626 1.280351
N  0.966641 -0.206025 -0.445105
N  0.479337 -1.957595 0.956937
N  3.430686 -0.67721 -0.660477
N  4.209543 -2.571509 0.645245
N  5.700279 -1.313346 -0.663106
C  0.854219 1.043782 -1.25928
C  0.132627 2.2068 -0.532477
C  1.288218 3.036624 0.121811
C  2.539412 2.721757 -0.728724
C  3.767786 2.418567 0.133405
C  2.151136 -0.897991 -0.188293
C  -0.0589 -0.928178 0.265866
C  1.844147 -1.957855 0.689027
C  -1.508475 -0.683825 0.242703
C  2.910887 -2.855075 1.190062
C  4.4178 -1.568343 -0.194086
C  -2.270662 -1.297891 1.283898
C  -2.19337 0.056214 -0.764995
C  -3.665341 -1.144368 1.348265
C  -3.592208 0.220855 -0.714513
C  -4.287098 -0.377071 0.346554
H  0.364632 0.824892 -2.222062
H  -0.595534 1.860126 0.221026
H  1.424605 2.726623 1.175947
H  2.751236 3.549019 -1.42694
H  3.527145 1.64571 0.893679
H  4.069278 3.353049 0.650278
H  -0.309434 3.949799 -1.390404
H  0.556157 4.796639 0.846702
H  3.659823 0.170776 -1.199075
H  5.643863 1.746263 -0.237564
H  -1.737076 -1.898945 2.025469
H  -1.665987 0.501435 -1.611833
H  -4.255543 -1.614515 2.140643
H  -4.124973 0.783372 -1.486924
H  5.858143 -0.742859 -1.492034
H  6.409771 -1.986259 -0.378055
H  -7.057947 1.629826 1.657204
