program: Gaussian 09
title: 000187206
version: EM64L-G09RevD.01
frameworkgroup: C1[X(C20H20Cl2O8)]
method: RPBEPBE
basis: SDD
operation: Freq
keyword: #p
keyword: freq=noraman
keyword: PBEPBE/SDD
title: #p freq=noraman PBEPBE/SDD
converged: NO YES NO NO
title: Mulliken charges:
elementType: Cl Cl O O O O O O O O C C C C C C C C C C C C C C C C C C C C H H H H H H H H H H H H H H H H H H H H
charge: 0.019820 0.031744 -0.246413 -0.278280 -0.458795 -0.453530 -0.453458 -0.407964 -0.205349 -0.430609 -0.138974 -0.186558 -0.120011 -0.046648 -0.095654 0.181689 0.348873 -0.366034 0.535785 -0.395353 -0.330834 -0.413216 -0.375651 0.519036 -0.645953 -0.396313 -0.336240 -0.385596 -0.376154 0.282385 0.229180 0.257821 0.264311 0.222029 0.251337 0.369752 0.366176 0.369087 0.268479 0.251253 0.281536 0.243041 0.249296 0.323758 0.386311 0.231350 0.228829 0.221663 0.253115 0.355928
chargesum: 0.00000
title: Mulliken charges with hydrogens summed into heavy atoms:
elementType: Cl Cl O O O O O O O O C C C C C C C C C C C C C C C C C C C C
charge: 0.019820 0.031744 -0.246413 -0.278280 -0.089043 -0.087354 -0.084371 -0.021653 -0.205349 -0.074681 0.090207 0.071263 0.144300 0.175381 0.155683 0.181689 0.348873 -0.097555 0.535785 -0.144100 -0.049298 -0.170175 -0.126355 0.519036 -0.322195 -0.164963 -0.107411 -0.163932 -0.123039 0.282385
polarizability: 3.21440552e+02 2.88521467e+01 2.80575348e+02 -2.62554038e+00 -1.68347503e+01 2.00659710e+02
1716.lowfreq: -9.0434 -4.4784 -0.0023 -0.0021 -0.0014 2.8849 8.4443 16.2153 25.3159
frequency: 7.5344 16.1401 25.2929 29.1321 37.0571 41.5013 43.4934 49.0756 56.9564 75.1556 96.9764 99.6068 116.6918 129.6751 142.6642 167.3499 180.8749 202.7087 209.7626 214.8267 230.4557 242.2606 260.4776 286.4828 294.5332 301.9043 315.4863 342.9245 362.0778 362.6928 384.2988 388.7240 392.3890 404.7949 407.7217 410.3714 429.2068 433.2947 437.7583 457.7012 499.0327 513.4260 523.3458 525.8766 533.8126 555.7536 594.4664 601.9332 618.7697 629.6502 635.5332 644.8511 678.8004 687.4817 716.7705 721.2437 739.4706 781.0475 790.6347 808.4278 816.4266 825.7499 832.2381 845.5486 868.4997 890.9441 924.3280 933.7846 947.2294 957.4782 958.9868 962.5011 968.5508 983.8804 1002.9608 1006.7689 1026.3800 1032.3132 1044.3365 1058.0857 1067.7244 1076.6160 1078.3053 1106.8014 1109.4347 1118.5695 1145.5284 1177.3912 1178.0447 1180.4158 1182.7532 1184.8290 1200.7869 1203.5919 1209.4585 1213.7416 1222.4460 1243.3397 1252.8563 1254.0596 1258.4402 1276.5657 1303.7966 1306.5881 1312.5055 1314.8639 1320.1653 1344.4367 1356.6697 1362.6101 1378.4380 1387.8770 1394.5066 1395.5949 1402.5490 1416.8208 1428.6585 1494.9379 1504.2220 1591.5717 1597.8999 1617.0346 1628.4939 1679.4041 2934.5182 2959.7556 3000.1760 3008.3126 3018.8138 3020.3604 3114.2450 3121.5662 3129.0266 3137.1749 3139.9244 3140.9058 3166.8096 3171.3468 3172.6523 3511.2061 3562.9054 3568.3353 3574.4131 3582.5226
redmass: 8.4106 7.4665 7.5699 5.4554 11.6147 12.5886 6.4910 4.0646 7.2654 8.0069 7.0509 7.5391 8.0342 7.1741 6.5126 9.2014 6.8114 5.6190 5.4945 6.0834 5.7369 8.2491 5.4961 6.8631 6.6330 6.1913 5.2138 4.8721 4.8684 1.1343 2.0277 1.3014 1.7162 5.6374 2.9100 2.9500 1.4571 4.8995 3.0538 4.1889 4.0962 4.2439 3.6076 4.1178 4.9499 3.6388 2.8650 4.4135 2.7794 3.0436 6.8569 3.4594 5.7313 6.9577 3.9840 5.3230 3.8917 3.3209 5.0640 1.6921 1.9582 1.3203 2.0251 2.1689 3.5182 5.2864 7.3764 1.3891 1.3804 1.3636 5.6853 1.4006 7.1254 5.9357 2.8842 2.9215 3.5005 4.1565 5.2808 2.9200 2.5925 3.3270 2.0494 1.4800 3.1178 1.3793 1.3605 1.4559 1.3197 1.2022 1.2574 1.9081 1.3406 1.6204 1.2051 2.0868 1.1875 1.3509 1.7648 2.5796 1.3074 1.2185 1.3270 1.2581 1.2151 1.3295 1.3405 1.3042 1.5986 1.5317 1.7407 4.1997 5.0006 1.4367 1.7712 3.0328 2.7814 2.4639 2.7038 7.2320 6.3041 6.4260 6.4599 9.3285 1.0833 1.0825 1.0837 1.0849 1.0856 1.0835 1.0877 1.0897 1.0891 1.0892 1.0963 1.0888 1.0957 1.0952 1.0955 1.0640 1.0657 1.0659 1.0659 1.0661
irintensity: 0.5215 0.6328 1.2129 0.2206 0.7458 0.1487 0.8319 0.1148 0.9517 1.7229 3.4653 1.6844 0.8691 0.4051 2.6657 0.8347 2.5539 2.3604 1.6087 17.5112 5.8080 1.3310 14.4450 2.3516 6.2791 1.4211 6.6868 19.0668 16.7190 137.5592 55.7318 97.7860 106.8268 8.5809 0.7273 0.6119 155.7884 4.6544 79.4179 8.7644 14.7342 13.9069 45.3556 2.2201 44.4065 17.7296 104.6389 98.7722 38.7191 25.6923 2.2644 30.6291 62.5750 50.3984 4.1460 43.0803 35.2756 2.8016 25.9106 36.2569 13.6631 4.8130 44.7761 24.0346 8.5454 40.4682 33.5526 0.3428 4.5719 0.2882 40.7952 4.7511 478.8725 40.1720 5.2855 21.9435 61.8179 63.7916 13.3478 164.1380 141.8576 38.1713 11.2012 64.2209 13.6117 13.7717 232.0097 131.5364 6.7479 50.3519 8.1392 4.2292 15.6328 52.2669 30.2535 138.8528 34.8419 14.2369 12.8926 25.2900 12.0233 9.1975 5.8368 68.5728 17.5421 5.2634 5.9051 18.2267 18.7131 7.8494 12.9160 14.3417 9.0485 2.8716 38.5123 1.8838 10.4374 173.8035 81.7070 11.2619 6.8353 56.2063 42.6235 212.7605 20.8663 25.9371 3.3617 6.1565 58.8955 5.2296 17.1359 5.7417 17.3310 9.5162 11.6132 6.6489 6.6270 4.2989 1.3723 28.6270 22.6525 28.8225 14.0061 47.6984
temp: 298.150 k
press: 1.00000 atm
elementType: 17 17 8 8 8 8 8 8 8 8 6 6 6 6 6 6 6 6 6 6 6 6 6 6 6 6 6 6 6 6 1 1 1 1 1 1 1 1 1 1 1 1 1 1 1 1 1 1 1 1
symmnumber: 1
zpe: 970719.7 jmol-1
zpe.correction: 0.369728 hartree
zpe.thermalcorrener: 0.399158 hartree
zpe.thermalcorrenthalpy: 0.400102 hartree
zpe.thermalcorrgfe: 0.304550 hartree
zpe.sumelectzpe: -2293.782419 hartree
zpe.sumelectthermal: -2293.752989 hartree
zpe.sumelectthermalent: -2293.752045 hartree
zpe.sumelectthermalfe: -2293.847596 hartree
dipole: 0.5916 -0.0241 1.4407
dipole: 1.5576
quadrupole: -205.6855 -183.5434 -179.7135
quadrupole: 25.7214 18.2876 -4.8848
quadrupole: -16.0380 6.1040 9.9340 25.7214 18.2876 -4.8848
hfenergy: -2294.1521465 hartree
pointgroup: C01 [X(C20H20Cl2O8)]
dipole: 0.2800152 -0.1553017 0.5225056 debye
polarizability: 324.4085128|26.2099287|280.3923603|-9.1454834|-0.0079068|197.8747376 unknown
InChI: InChI=1S/C20H20Cl2O8/c21-18(22)13(9-1-5-11(23)6-2-9)10-3-7-12(8-4-10)29-20-16(26)14(24)15(25)17(30-20)19(27)28/h1-8,13-18,20,23-27H
charge 0 multiplicity 1
50 atoms
Cl 3.12749 -3.6436 -2.071794
Cl 5.666001 -1.985935 -2.281778
O  -2.937235 0.518497 0.728931
O  -1.978971 -1.622334 1.007202
O  -6.773271 -1.163329 0.357723
O  -4.459574 -2.876807 0.125827
O  -6.282501 1.566482 -0.52724
O  -3.010526 3.514156 -0.286065
O  -4.246941 3.170639 1.65461
O  5.921268 3.767613 0.718943
C  -5.445448 -0.706441 -0.05558
C  -4.331537 -1.506683 0.62966
C  -5.374409 0.783181 0.308632
C  -2.96927 -0.888805 0.274255
C  -3.962621 1.330155 0.025442
C  -3.7891 2.744152 0.578266
C  -0.615547 -1.497176 0.62504
C  3.636391 -1.426555 -0.392296
C  2.138585 -1.430409 -0.030891
C  0.243264 -2.504926 1.112882
C  -0.114418 -0.438325 -0.164972
C  1.611013 -2.466081 0.780973
C  1.259613 -0.417765 -0.486473
C  4.281797 -0.056372 -0.138924
C  3.844144 -1.92563 -1.837693
C  4.81081 0.212585 1.146237
C  4.323205 0.979681 -1.108354
C  5.361322 1.471066 1.466681
C  4.872706 2.240793 -0.808525
C  5.38913 2.488787 0.483394
H  -5.329364 -0.819541 -1.15656
H  -4.444809 -1.468952 1.732464
H  -5.611455 0.907311 1.3846
H  -2.767031 -0.932022 -0.82114
H  -3.775117 1.335828 -1.067131
H  -6.82928 -2.136915 0.17876
H  -3.789717 -3.445279 0.583431
H  -7.199757 1.222065 -0.377591
H  4.141273 -2.164096 0.260243
H  -0.168972 -3.303771 1.736496
H  -0.766732 0.381731 -0.47659
H  2.273185 -3.259776 1.144166
H  1.648198 0.424731 -1.068632
H  3.364002 -1.309445 -2.608681
H  -2.885937 4.424998 0.097484
H  4.790573 -0.571096 1.912874
H  3.948466 0.809125 -2.124132
H  5.766134 1.654213 2.470437
H  4.915192 3.037281 -1.556963
H  6.261579 3.845092 1.644646
