program: Gaussian 09
title: 000187145
version: EM64L-G09RevD.01
frameworkgroup: C1[X(C19H12O3)]
method: RPBEPBE
basis: SDD
operation: Freq
keyword: #pfreq=noraman
keyword: PBEPBE/SDD
title: #p freq=noraman PBEPBE/SDD
converged: YES YES NO NO
title: Mulliken charges:
elementType: O O O C C C C C C C C C C C C C C C C C C C H H H H H H H H H H H H
charge: -0.290358 -0.431705 -0.258048 -0.002717 0.294447 0.272554 0.239816 0.115892 -0.653183 0.272016 0.119615 -0.396280 -0.432450 -0.376413 0.325806 -0.233036 -0.229993 -0.372887 -0.355734 -0.238481 -0.224630 -0.236517 0.278383 0.258609 0.249915 0.281676 0.232593 0.233627 0.233180 0.254967 0.370194 0.232982 0.231212 0.234947
chargesum: 0.00000
title: Mulliken charges with hydrogens summed into heavy atoms:
elementType: O O O C C C C C C C C C C C C C C C C C C C
charge: -0.290358 -0.061510 -0.258048 -0.002717 0.294447 0.272554 0.239816 0.115892 -0.374800 0.272016 0.119615 -0.137671 -0.182535 -0.094737 0.325806 -0.000443 0.003634 -0.139706 -0.100767 -0.005499 0.006581 -0.001570
polarizability: 3.55120937e+02 -1.09607241e+00 2.82775024e+02 -2.59520767e+00 -2.99342048e+00 8.14779577e+01
1716.lowfreq: -0.0006 0.0003 0.0005 3.4935 7.8123 11.2020 21.9478 43.1237 78.8243
frequency: 21.9395 43.0731 78.8238 83.3727 113.9615 153.4155 175.7621 193.5603 218.6569 232.7334 246.6613 273.3077 314.4697 371.0099 384.6311 399.0791 399.4699 429.0344 458.3778 471.6526 480.1511 483.7709 524.2691 539.1997 610.2678 616.2086 618.1045 631.1646 637.8184 641.1147 666.8020 692.9042 731.3906 743.3970 781.9859 784.3134 794.8773 796.4969 847.3483 851.3449 869.5576 889.8574 896.3577 927.9204 933.9995 978.3050 983.0071 989.5243 999.3656 1001.9969 1003.1007 1025.6088 1032.8345 1042.8419 1070.5937 1088.4902 1139.5119 1170.7718 1175.9525 1181.8845 1194.8525 1196.2887 1236.7065 1251.1687 1262.6435 1286.9216 1316.2365 1336.0729 1385.8947 1396.0357 1402.7515 1428.8099 1439.3734 1448.8777 1459.6880 1481.3634 1521.9603 1549.5003 1571.5741 1585.8108 1600.3064 1612.6176 1614.4175 1639.5888 3131.6800 3131.8427 3135.3278 3141.0609 3152.6817 3153.7599 3166.1312 3171.2916 3178.3156 3178.9167 3188.4277 3587.2097
redmass: 3.7123 6.2797 6.5173 6.1340 4.8759 4.5773 6.8040 5.8054 4.7916 5.3669 6.6576 7.1523 6.7993 6.0461 1.4839 2.7467 3.0278 3.0106 5.1705 5.9541 5.4658 4.6524 10.1073 5.7824 7.1527 6.4235 4.1295 3.6079 5.0700 4.9816 6.1509 1.7498 6.2783 3.0159 1.9557 1.4412 3.1380 5.2437 1.3946 5.5840 1.4882 1.5033 1.6919 5.4049 1.5563 1.3783 1.4155 5.6480 4.0681 1.3882 1.3318 3.1121 2.0125 2.8531 4.4405 1.6000 1.3885 1.1743 1.0565 1.5571 1.1841 1.5288 2.6547 2.4321 1.8776 2.3347 1.8320 2.1791 8.1276 3.3204 9.5168 2.9443 2.3493 3.3925 4.2476 2.3415 4.7167 9.8008 7.2167 6.1324 7.3760 7.0623 6.0513 7.7621 1.0857 1.0914 1.0863 1.0886 1.0908 1.0938 1.0977 1.0950 1.0976 1.0985 1.0913 1.0660
irintensity: 0.0444 1.0442 0.0978 0.1264 0.7093 1.3044 5.1680 0.6891 0.7509 5.2080 1.6181 12.8921 0.6217 6.4999 104.0268 3.5071 34.3806 1.7160 4.3265 7.5408 1.7073 2.4058 3.7135 1.9029 1.8805 0.3563 5.0257 0.0309 19.1724 13.5346 7.8710 50.9411 9.1193 1.9464 61.0136 77.1259 4.3176 13.8450 7.3168 12.9464 42.9798 14.7961 0.9184 6.4983 3.2306 2.8775 0.5191 1.8637 31.1932 1.8972 0.0661 49.7252 7.7479 137.2347 5.8179 15.3589 38.6651 3.7281 1.2259 5.3250 4.8079 169.0117 3.2646 16.6294 6.0257 57.6267 32.8829 72.0509 0.5372 72.3814 179.1416 49.8597 27.0497 22.6574 51.7246 15.3028 32.1511 120.3584 52.8345 26.6757 41.5834 172.7925 30.6989 44.3997 4.0754 13.4062 3.8371 4.9286 15.3677 23.1770 27.2082 8.0922 9.0968 16.6469 4.7500 66.0213
temp: 298.150 k
press: 1.00000 atm
elementType: 8 8 8 6 6 6 6 6 6 6 6 6 6 6 6 6 6 6 6 6 6 6 1 1 1 1 1 1 1 1 1 1 1 1
symmnumber: 1
zpe: 666759.7 jmol-1
zpe.correction: 0.253955 hartree
zpe.thermalcorrener: 0.270615 hartree
zpe.thermalcorrenthalpy: 0.271560 hartree
zpe.thermalcorrgfe: 0.208973 hartree
zpe.sumelectzpe: -955.425667 hartree
zpe.sumelectthermal: -955.409007 hartree
zpe.sumelectthermalent: -955.408063 hartree
zpe.sumelectthermalfe: -955.470649 hartree
dipole: 1.0738 -3.5964 -0.0525
dipole: 3.7536
quadrupole: -97.0418 -125.2759 -132.9452
quadrupole: -4.2912 -0.8078 -1.4777
quadrupole: 21.3792 -6.8550 -14.5242 -4.2912 -0.8078 -1.4777
hfenergy: -955.6796225 hartree
pointgroup: C01 [X(C19H12O3)]
dipole: 0.3921332 1.4236297 -0.0204341 debye
polarizability: 354.9885202|2.796434|282.4828612|4.5624647|-9.1195304|81.9025376 unknown
InChI: InChI=1S/C19H12O3/c20-16-10-15-17(21)11-18(12-6-2-1-3-7-12)22-19(15)14-9-5-4-8-13(14)16/h1-11,20H
charge 0 multiplicity 1
34 atoms
O  0.604519 0.277324 0.018539
O  -4.764623 -1.398247 -0.005723
O  -0.142575 -3.826455 0.064299
C  -0.720092 -0.193644 0.013362
C  -1.75012 0.808821 -0.003204
C  -1.014898 -1.565582 0.029708
C  -3.125112 0.367579 -0.011109
C  -3.405218 -1.051601 0.002485
C  -2.379982 -1.990097 0.02381
C  1.668862 -0.637015 0.034127
C  0.082917 -2.567756 0.049284
C  -1.466979 2.210477 -0.01056
C  1.428598 -1.996242 0.043491
C  -4.171321 1.339534 -0.03035
C  2.985151 0.036168 0.027797
C  -2.509341 3.142519 -0.028905
C  -3.868792 2.705551 -0.039956
C  4.177932 -0.696473 0.282501
C  3.082033 1.430862 -0.235412
C  5.430755 -0.052826 0.26511
C  4.3378 2.071457 -0.25082
C  5.518371 1.334043 -0.002626
H  -2.559618 -3.072067 0.036031
H  -0.424219 2.539327 0.003142
H  2.26364 -2.699664 0.031181
H  -5.206848 0.988958 -0.036681
H  -2.284291 4.214367 -0.033433
H  -4.676448 3.445139 -0.054513
H  4.13083 -1.76617 0.510233
H  2.170555 2.000977 -0.433575
H  -4.876327 -2.381008 0.004453
H  6.339161 -0.630617 0.466454
H  4.395962 3.14536 -0.458781
H  6.493719 1.832401 -0.014558
