program: Gaussian 09
title: 000187094
version: EM64L-G09RevD.01
frameworkgroup: C1[X(C10H10O2)]
method: RPBEPBE
basis: SDD
operation: Freq
keyword: #pfreq=noraman
keyword: PBEPBE/SDD
title: #p freq=noraman PBEPBE/SDD
converged: YES YES NO NO
title: Mulliken charges:
elementType: O O C C C C C C C C C C H H H H H H H H H H
charge: -0.436441 -0.436497 0.191040 0.191432 -0.220385 -0.220276 -0.259484 -0.259962 -0.342303 -0.342374 -0.239951 -0.239942 0.233640 0.233651 0.243458 0.243513 0.263563 0.263576 0.231558 0.231565 0.335317 0.335299
chargesum: 0.00000
title: Mulliken charges with hydrogens summed into heavy atoms:
elementType: O O C C C C C C C C C C
charge: -0.101124 -0.101197 0.191040 0.191432 0.013256 0.013375 -0.016026 -0.016449 -0.078740 -0.078798 -0.008392 -0.008377
polarizability: 1.29095308e+02 -4.31623738e-04 1.27696811e+02 -1.57542847e-02 -9.63091458e+00 6.43805279e+01
1716.lowfreq: -14.1448 -0.0010 -0.0008 -0.0007 3.6147 8.4442 44.3216 97.7011 159.3304
frequency: 44.2824 97.6631 159.3291 191.0187 260.8613 285.9458 338.8076 377.4432 386.4542 429.4772 439.4536 460.0661 503.9696 531.4271 574.5631 643.1401 694.3311 736.1358 765.7449 771.5523 791.8800 857.5873 883.8115 901.1548 944.8089 964.0861 976.9908 993.4347 1002.6615 1038.6494 1042.5444 1114.9963 1168.7583 1176.3261 1191.7855 1199.5685 1203.6175 1204.6284 1253.7839 1327.0266 1335.1481 1351.4874 1354.5494 1376.9131 1385.9653 1442.5891 1482.9868 1586.3819 1614.7506 1670.7488 3006.3745 3006.7468 3118.0152 3127.2425 3137.8318 3147.4896 3149.7012 3164.5639 3541.2510 3541.6062
redmass: 4.6074 4.2512 4.4224 3.7336 4.5818 3.5906 1.1628 1.3695 2.8241 4.6743 2.9666 5.5574 3.9319 5.5826 3.6339 4.6696 4.3695 2.6028 3.3067 1.3194 3.6036 2.2875 1.3849 5.3243 6.9089 1.3920 2.4156 1.3198 1.5904 2.4235 2.1587 1.7690 1.1688 1.0726 1.2642 1.4200 1.7429 1.3747 1.5524 1.6331 2.0860 1.1476 1.1508 1.6211 7.6357 2.5145 2.5495 7.1631 6.3175 7.4594 1.0830 1.0828 1.0846 1.0851 1.0893 1.0994 1.0950 1.1009 1.0663 1.0662
irintensity: 3.6517 0.2407 0.0702 0.8350 0.6729 3.6215 1.0132 271.9276 0.1957 14.0939 1.1870 0.7252 0.0005 11.7623 19.6533 0.6081 0.2495 7.2230 11.5683 101.0480 0.4687 149.5323 0.0066 18.6665 92.4407 0.7407 10.8916 0.0006 3.9813 0.0784 0.3636 2.0950 4.0743 0.0028 38.0407 2.0054 25.5530 6.3469 0.8534 0.6412 21.2538 61.9442 7.2605 13.2389 0.0001 10.3940 8.4058 0.2786 0.3559 0.2045 8.2902 24.4930 3.2243 0.3872 4.9029 36.0075 17.2866 23.8719 12.7817 1.1268
temp: 298.150 k
press: 1.00000 atm
elementType: 8 8 6 6 6 6 6 6 6 6 6 6 1 1 1 1 1 1 1 1 1 1
symmnumber: 1
zpe: 457404.8 jmol-1
zpe.correction: 0.174216 hartree
zpe.thermalcorrener: 0.184446 hartree
zpe.thermalcorrenthalpy: 0.185391 hartree
zpe.thermalcorrgfe: 0.138385 hartree
zpe.sumelectzpe: -536.615330 hartree
zpe.sumelectthermal: -536.605100 hartree
zpe.sumelectthermalent: -536.604156 hartree
zpe.sumelectthermalfe: -536.651161 hartree
dipole: -0.4340 -0.0007 -0.0014
dipole: 0.4340
quadrupole: -62.8091 -80.7911 -66.3494
quadrupole: -0.0027 -0.0154 -0.1161
quadrupole: 7.1741 -10.8079 3.6338 -0.0027 -0.0154 -0.1161
hfenergy: -536.7895464 hartree
pointgroup: C01 [X(C10H10O2)]
dipole: -0.1706035 0.0018946 0.0067104 debye
dipolederiv: -0.6947973 0.0196506 0.0285519 0.102125 -0.7167157 -0.2201359 0.0568082 -0.2919358 -0.2750209 -0.7018266 -0.0417454 -0.0011293 -0.1190105 -0.7144828 -0.2114624 -0.0306205 -0.2880736 -0.270018 -0.0517206 -0.0271738 0.0021641 -0.0497207 -0.0807603 -0.0496842 -0.010632 -0.0383126 -0.0878359 -0.0497051 0.02364 -0.006051 0.0452854 -0.0823327 -0.0530265 0.0068274 -0.0405567 -0.0878327 0.4913149 0.0212981 -0.0179434 -0.0901773 0.5160713 0.1533067 -0.0257058 0.2177286 0.4538042 0.4959404 -0.0040957 0.0178767 0.1024696 0.5148815 0.1460218 0.0271355 0.2185218 0.4499928 0.0457532 -0.0408257 0.0228761 0.0089495 -0.0554536 -0.1181231 0.0340368 -0.1076312 -0.2220394 0.0405317 0.0308012 -0.0440996 -0.0196301 -0.0564946 -0.1168157 -0.0550495 -0.110288 -0.2162725 -0.1415825 -0.0074765 -0.0040132 0.0222763 0.0929864 -0.0710469 -0.0285771 -0.0317806 -0.1215575 -0.1395609 0.009808 0.0041087 -0.0227347 0.0933544 -0.0694411 0.0293882 -0.0327443 -0.1239953 0.0726999 0.0778267 -0.0358833 0.0591203 -0.0283585 -0.0478642 -0.012813 -0.0424852 -0.1441575 0.0722575 -0.0825672 0.0193518 -0.0643357 -0.0255959 -0.0440534 -0.0036165 -0.0367989 -0.1464195 0.0108514 -0.0239429 0.0068555 0.034634 -0.036571 0.0757917 -0.0096953 0.0221959 -0.0797631 0.0103716 0.0244707 -0.0118387 -0.0301114 -0.0363252 0.0781514 0.0035789 0.0201959 -0.0796369 -0.1027289 0.0649949 -0.0118141 0.0903287 0.0566132 0.0307871 -0.0060214 0.0583669 0.140363 -0.103044 -0.0574748 0.0299638 -0.0847747 0.0595867 0.0367353 0.0247968 0.0625867 0.1377318 0.0983869 0.0208799 -0.0126324 -0.0150225 -0.0473287 0.0624606 -0.0008238 0.0554552 0.1320833 0.0996143 -0.0197426 0.0161963 0.0166125 -0.0471713 0.0609687 0.0042229 0.0568307 0.1308974 -0.0857802 -0.0817899 0.0353893 -0.0878482 0.047334 0.0359423 0.038125 0.0332401 0.1454992 -0.0863822 0.086569 -0.0179215 0.0927612 0.0439194 0.0299651 -0.0207228 0.0277003 0.149563 0.3576147 -0.0103778 -0.0233657 -0.0289671 0.2516539 0.1472382 -0.0408723 0.1249132 0.0591184 0.3617918 0.0172733 0.0033583 0.0377704 0.2511897 0.1442844 0.0202302 0.1228714 0.0554961 unknown
polarizability: 129.0042424|-0.4771106|126.6469327|-2.4057268|-12.5658717|65.5214715 unknown
InChI: InChI=1S/C10H10O2/c11-9-5-6-10(12)8-4-2-1-3-7(8)9/h1-6,9-12H
charge 0 multiplicity 1
22 atoms
O  1.061055 -2.698942 -0.407769
O  1.139146 2.751537 0.235973
C  -0.229294 -0.640863 0.168703
C  -0.230715 0.719352 -0.241134
C  1.062265 -1.423892 0.372827
C  1.058151 1.476021 -0.539773
C  2.31455 -0.633321 0.077714
C  2.312465 0.660598 -0.334503
C  -1.464569 -1.296252 0.414086
C  -1.46731 1.399092 -0.397322
C  -2.687238 -0.615679 0.255176
C  -2.688535 0.742421 -0.150768
H  1.103988 -1.81051 1.409248
H  1.032408 1.86098 -1.577368
H  3.257481 -1.178343 0.210336
H  3.253911 1.187068 -0.535269
H  -1.450109 -2.349259 0.71635
H  -1.453731 2.451864 -0.700401
H  -3.63331 -1.134461 0.445165
H  -3.635507 1.279657 -0.272786
H  1.008803 -2.46411 -1.370722
H  1.155697 2.51844 1.200637
