program: Gaussian 09
title: 000187086
version: EM64L-G09RevD.01
frameworkgroup: C1[X(C13H12O2)]
method: RPBEPBE
basis: SDD
operation: Freq
keyword: #pfreq=noraman
keyword: PBEPBE/SDD
title: #p freq=noraman PBEPBE/SDD
converged: YES YES NO NO
title: Mulliken charges:
elementType: O O C C C C C C C C C C C C C H H H H H H H H H H H H
charge: -0.285801 -0.437677 -0.272846 -0.247679 -0.180227 0.397549 0.309080 0.485995 -0.436533 -0.422217 -0.433509 -0.434042 -0.218464 -0.215009 -0.524778 0.212050 0.235960 0.248164 0.255807 0.238376 0.238022 0.222053 0.222930 0.358471 0.239064 0.208409 0.236851
chargesum: 0.00000
title: Mulliken charges with hydrogens summed into heavy atoms:
elementType: O O C C C C C C C C C C C C C
charge: -0.285801 -0.079206 -0.060797 -0.011719 -0.180227 0.397549 0.309080 0.485995 -0.188369 -0.166410 -0.195132 -0.196020 0.003589 0.007921 0.159546
polarizability: 1.79368702e+02 6.48780945e+00 1.80741599e+02 8.91124402e+00 -4.09742884e-01 7.51882115e+01
1716.lowfreq: -11.7321 -6.8468 -0.0010 -0.0009 -0.0003 1.0330 34.7222 98.2379 112.9449
frequency: 34.5545 98.2293 112.9426 162.6573 167.1305 201.4247 263.6380 266.4822 298.3913 325.7170 385.9278 432.1922 465.1421 473.2124 488.7277 534.3380 536.4298 579.5950 597.8332 648.7733 683.5543 718.3865 766.4387 791.1865 795.1386 811.9341 843.6185 863.6266 908.1038 922.6810 930.0280 975.5744 978.3844 986.8464 1002.6094 1026.3711 1036.6846 1046.8494 1104.7079 1109.1705 1143.7631 1168.8194 1176.1284 1189.8401 1211.0222 1235.5544 1244.1542 1261.5591 1276.0025 1310.6448 1369.0352 1374.5105 1394.4932 1415.6292 1425.7653 1455.7882 1467.3685 1470.3383 1480.6279 1502.2475 1606.3517 1612.9243 1634.1519 2953.2891 2980.5472 3041.1906 3046.2254 3109.0554 3123.1540 3123.6374 3140.2480 3141.7302 3157.7486 3158.9255 3466.3924
redmass: 4.7176 2.7749 4.4884 2.1610 1.7476 3.6078 4.2307 2.8604 3.4282 5.2818 4.9507 3.7753 3.1894 4.4548 1.4347 5.5655 5.4703 4.8883 4.1485 3.7822 4.1982 4.4863 1.2765 1.8018 5.0255 4.2686 2.6760 2.8584 1.9409 1.6839 2.7597 3.1930 1.6262 1.3742 5.6634 2.7999 4.8824 2.0140 2.5017 1.2649 1.3298 1.2012 1.2394 1.2772 1.4081 1.3576 1.7679 2.0427 1.5818 1.3804 1.4514 1.9819 4.5829 1.8510 1.1405 1.0534 3.0545 6.9552 1.0562 4.6540 6.8589 7.9238 7.9005 1.0325 1.0851 1.0861 1.1025 1.1007 1.0863 1.0860 1.0926 1.0925 1.0982 1.0978 1.0645
irintensity: 1.5084 13.2506 2.1876 7.0704 3.3288 3.9733 0.8192 29.9426 2.9290 6.1827 2.4381 5.4556 1.2518 5.8439 100.5195 7.2309 2.7087 4.4295 4.4207 1.7961 1.9166 19.7912 0.7197 86.6050 1.6723 30.3141 45.4832 4.0265 5.2448 1.9731 10.1705 17.4061 7.1813 3.0815 34.9708 1.4440 128.5940 38.2914 8.0311 1.0705 5.1761 9.4725 6.9075 4.3599 4.7716 16.1328 2.8859 3.6476 9.3098 18.2333 42.8765 6.6846 2.5556 0.1563 3.4417 10.3615 2.6910 3.0376 11.9815 6.8493 0.2114 1.7895 3.5433 75.2880 36.0419 33.4009 33.1206 24.2954 2.2154 0.3903 12.5172 26.4318 46.5098 13.1479 21.3977
temp: 298.150 k
press: 1.00000 atm
elementType: 8 8 6 6 6 6 6 6 6 6 6 6 6 6 6 1 1 1 1 1 1 1 1 1 1 1 1
symmnumber: 1
zpe: 563704.9 jmol-1
zpe.correction: 0.214704 hartree
zpe.thermalcorrener: 0.226945 hartree
zpe.thermalcorrenthalpy: 0.227890 hartree
zpe.thermalcorrgfe: 0.176147 hartree
zpe.sumelectzpe: -651.951928 hartree
zpe.sumelectthermal: -651.939686 hartree
zpe.sumelectthermalent: -651.938742 hartree
zpe.sumelectthermalfe: -651.990485 hartree
dipole: 0.1896 1.5280 1.0781
dipole: 1.8797
quadrupole: -73.2586 -84.6455 -89.2809
quadrupole: 5.0449 3.8593 0.4734
quadrupole: 9.1363 -2.2505 -6.8859 5.0449 3.8593 0.4734
hfenergy: -652.1666317 hartree
pointgroup: C01 [X(C13H12O2)]
dipole: 0.0717114 0.6068646 0.4164993 debye
polarizability: 179.2612204|6.6124569|180.7305574|9.3366455|-1.7670299|75.3067347 unknown
InChI: InChI=1S/C13H12O2/c1-15-13-10-7-3-5-8-4-2-6-9(11(8)10)12(13)14/h2-7,12-14H,1H3
charge 0 multiplicity 1
27 atoms
O  2.617335 0.4939 -0.593144
O  2.187031 -2.119449 -0.292929
C  1.717392 0.229379 0.549073
C  1.351779 -1.33429 0.618245
C  -0.632744 -0.055137 0.160329
C  0.387155 0.927167 0.310167
C  -0.143016 -1.3842 0.296963
C  -2.000066 0.260186 -0.106886
C  0.053854 2.275883 0.195007
C  -1.026678 -2.452283 0.151394
C  -2.322133 1.655261 -0.212038
C  -2.894569 -0.854448 -0.246147
C  -1.317434 2.624939 -0.062645
C  -2.409713 -2.166705 -0.123848
C  4.044422 0.42366 -0.226993
H  2.213129 0.565061 1.482461
H  1.56596 -1.749127 1.618459
H  0.810262 3.062946 0.28272
H  -0.685231 -3.489426 0.233601
H  -3.355174 1.962473 -0.414118
H  -3.957214 -0.678631 -0.451372
H  -1.58155 3.685108 -0.150348
H  -3.105901 -3.005701 -0.238193
H  2.302707 -1.557584 -1.108567
H  4.311884 -0.579195 0.156933
H  4.291385 1.194419 0.530542
H  4.599728 0.630093 -1.15557
