program: Gaussian 09
title: 000184913
version: EM64L-G09RevD.01
frameworkgroup: C1[X(C18H10Cl4)]
method: RPBEPBE
basis: SDD
operation: Freq
keyword: #p
keyword: freq=noraman
keyword: PBEPBE/SDD
title: #p freq=noraman PBEPBE/SDD
converged: NO YES NO NO
title: Mulliken charges:
elementType: Cl Cl Cl Cl C C C C C C C C C C C C C C C C C C H H H H H H H H H H
charge: 0.028277 0.041694 0.005297 0.052308 0.273075 0.265627 0.441189 -0.347849 -0.347828 0.266052 -0.366807 -0.366804 -0.348032 -0.392465 -0.384705 -0.383102 -0.027206 -0.081358 -0.105056 -0.218080 -0.217849 -0.238639 0.245539 0.245539 0.249696 0.249696 0.285000 0.243694 0.245935 0.228178 0.228573 0.230409
chargesum: 0.00000
title: Mulliken charges with hydrogens summed into heavy atoms:
elementType: Cl Cl Cl Cl C C C C C C C C C C C C C C C C C C
charge: 0.028277 0.041694 0.005297 0.052308 0.273075 0.265627 0.441189 -0.102310 -0.102290 0.266052 -0.117111 -0.117108 -0.348032 -0.107465 -0.141011 -0.137166 -0.027206 -0.081358 -0.105056 0.010098 0.010724 -0.008229
polarizability: 3.61772948e+02 9.29315690e+00 2.23991719e+02 -2.99384860e-03 -7.89522906e-03 1.22943307e+02
1716.lowfreq: -69.1152 -23.3057 -3.1850 -2.3017 -0.0021 -0.0011 -0.0008 7.3307 22.0709
frequency: -69.1152 -23.2140 22.0400 32.4501 67.5153 77.1347 79.9490 100.0214 142.8528 193.2851 208.5379 209.4560 212.6356 213.9686 257.0113 295.4825 314.2739 330.2680 360.2024 378.9462 391.2468 395.2390 397.5117 507.7297 514.9216 532.4782 539.0120 585.8691 595.2772 613.1008 617.7481 645.2440 652.8525 705.6521 733.6639 737.3524 747.4656 769.6391 780.0381 829.5954 842.6880 847.7170 853.1344 884.4415 919.8358 957.2201 971.8612 973.7265 986.8607 995.1772 995.5345 1006.1201 1023.1573 1042.0027 1076.9160 1100.2301 1110.5427 1167.6473 1172.3715 1186.9621 1191.7185 1266.4850 1286.9619 1298.2817 1309.8382 1320.2753 1339.3073 1341.3922 1367.8364 1394.2259 1401.0469 1427.8134 1473.8366 1510.4284 1526.4979 1558.4543 1572.3507 1583.0876 1609.9732 1622.3522 3122.6151 3128.2021 3131.0761 3132.1833 3140.0769 3149.3095 3151.3864 3156.8580 3164.3616 3172.6648
redmass: 3.7733 4.2592 8.2649 10.2925 9.0644 30.4797 6.7486 6.7719 10.7312 21.1670 8.4154 22.6124 6.9922 18.7907 6.1827 4.2960 22.7654 18.6736 9.4053 6.0839 4.0763 4.0821 2.9116 7.5615 5.6210 3.7311 4.6177 10.7809 3.4172 8.2892 5.1339 8.0516 7.9404 1.7248 6.5719 5.3862 4.4190 1.9689 8.0237 7.8738 1.7058 1.2447 1.2394 1.4519 1.4009 1.3389 1.3766 1.3810 6.2229 6.9044 1.3094 7.2362 2.9690 1.9933 1.6036 4.4097 1.4065 1.8597 1.0530 1.1155 1.1110 3.8158 2.9571 1.2659 1.3714 5.6410 5.4962 9.1523 6.7559 3.3811 4.0099 2.2065 2.2657 3.2580 10.2086 7.2307 8.1945 6.0046 6.1941 6.6530 1.0845 1.0878 1.0878 1.0880 1.0925 1.0968 1.0967 1.0979 1.1018 1.0930
irintensity: 0.0010 0.0035 0.0139 0.0011 0.0296 0.0120 0.0234 0.4582 0.1815 0.0156 0.9339 0.0388 0.5083 0.0091 0.7244 0.0954 0.0166 0.3611 4.0883 0.1721 0.0002 0.0214 0.0052 12.0623 0.2632 16.2615 0.5072 21.7436 30.7602 0.2935 4.4973 0.0972 35.8383 54.4434 10.6896 0.0644 2.2913 47.4444 48.1236 2.4511 25.0879 0.0028 0.0003 14.8057 1.3894 0.3776 0.0401 0.0020 0.1311 36.2190 0.1127 9.8735 5.5036 7.8242 8.0317 8.1657 7.2985 37.6038 0.0208 2.0635 0.1057 32.9824 1.0945 0.0007 0.6989 55.9855 1.3826 17.9673 0.0925 5.5845 141.4421 7.3803 29.1745 5.2386 21.6470 0.0000 2.4523 1.5853 9.3649 0.0419 2.6415 0.1224 0.0562 17.0374 17.0789 36.8066 20.2505 0.0074 26.3281 0.1345
temp: 298.150 k
press: 1.00000 atm
elementType: 17 17 17 17 6 6 6 6 6 6 6 6 6 6 6 6 6 6 6 6 6 6 1 1 1 1 1 1 1 1 1 1
symmnumber: 1
zpe: 572728.4 jmol-1
zpe.correction: 0.218141 hartree
zpe.thermalcorrener: 0.235851 hartree
zpe.thermalcorrenthalpy: 0.236795 hartree
zpe.thermalcorrgfe: 0.170159 hartree
zpe.sumelectzpe: -2530.644849 hartree
zpe.sumelectthermal: -2530.627139 hartree
zpe.sumelectthermalent: -2530.626195 hartree
zpe.sumelectthermalfe: -2530.692832 hartree
dipole: -3.3454 0.9162 0.0004
dipole: 3.4686
quadrupole: -148.8703 -152.7264 -151.9414
quadrupole: -0.7697 -0.0004 -0.0084
quadrupole: 2.3090 -1.5470 -0.7620 -0.7697 -0.0004 -0.0084
hfenergy: -2530.86299 hartree
pointgroup: C01 [X(C18H10Cl4)]
dipole: -1.317105 -0.3570625 -0.0001425 debye
polarizability: 361.7241437|-9.648038|224.0405228|0.0029735|-0.0079029|122.9433075 unknown
InChI: InChI=1S/C18H10Cl4/c19-15-10-14(16(20)18(22)17(15)21)13-8-6-12(7-9-13)11-4-2-1-3-5-11/h1-10H
charge 0 multiplicity 1
32 atoms
Cl 1.893568 2.679579 0.0008
Cl 5.115365 2.524868 0.000817
Cl 4.79079 -3.052286 -0.000657
Cl 6.589131 -0.335189 0.000081
C  0.436107 -0.07695 0.000026
C  -2.421179 -0.07278 -0.000053
C  1.936262 -0.106142 0.000054
C  -0.283329 -0.078599 1.220972
C  -0.28326 -0.077192 -1.220963
C  -3.923286 -0.063812 -0.000092
C  -1.6952 -0.076151 1.219119
C  -1.695129 -0.074742 -1.219187
C  2.722218 1.074191 0.00038
C  2.606046 -1.352543 -0.000259
C  -4.653982 -1.280814 0.000318
C  -4.636645 1.163469 -0.000538
C  4.137435 1.012123 0.000394
C  4.010717 -1.42165 -0.000248
C  4.792058 -0.244563 0.000074
C  -6.067696 -1.270996 0.000277
C  -6.050319 1.173448 -0.00057
C  -6.770298 -0.043728 -0.000166
H  0.261593 -0.076979 2.171651
H  0.261717 -0.074495 -2.171608
H  -2.241454 -0.07534 2.168851
H  -2.24133 -0.072861 -2.168949
H  2.019568 -2.275123 -0.000516
H  -4.111692 -2.233402 0.000653
H  -4.080635 2.108042 -0.000844
H  -6.618326 -2.218551 0.000585
H  -6.587416 2.128713 -0.000904
H  -7.866099 -0.035942 -0.000196
