program: Gaussian 09
title: 000187109
version: EM64L-G09RevD.01
frameworkgroup: C1[X(C17H24O5)]
method: RPBEPBE
basis: SDD
operation: Freq
keyword: #pfreq=noraman
keyword: PBEPBE/SDD
title: #p freq=noraman PBEPBE/SDD
converged: YES YES NO NO
title: Mulliken charges:
elementType: O O O O O C C C C C C C C C C C C C C C C C H H H H H H H H H H H H H H H H H H H H H H H H
charge: -0.275278 -0.450575 -0.241693 -0.269615 -0.244297 -0.051178 -0.404193 -0.437873 -0.365948 -0.327576 -0.357979 -0.363025 -0.697695 0.182273 0.184793 0.210627 -0.368469 -0.367486 -0.220544 -0.219022 0.144021 -0.517088 0.222171 0.235475 0.163138 0.237637 0.220750 0.198390 0.193357 0.240040 0.218185 0.186610 0.211289 0.203635 0.202126 0.208014 0.212153 0.216568 0.341191 0.268611 0.267614 0.239435 0.239246 0.234059 0.252416 0.245710
chargesum: 0.00000
title: Mulliken charges with hydrogens summed into heavy atoms:
elementType: O O O O O C C C C C C C C C C C C C C C C C
charge: -0.275278 -0.109384 -0.241693 -0.269615 -0.244297 0.170993 -0.005580 0.020514 0.025799 0.130648 0.039920 0.042736 -0.060960 0.182273 0.184793 0.210627 -0.099859 -0.099872 0.018891 0.020224 0.144021 0.215097
polarizability: 2.45071624e+02 1.16249396e-01 2.08214588e+02 -3.03354073e+01 1.00043254e+00 1.51089783e+02
1716.lowfreq: -7.2868 -1.2627 -0.0005 -0.0003 0.0005 6.7135 15.3577 25.4621 32.2659
frequency: 14.4329 25.1814 32.2512 37.3265 47.7661 64.2207 66.3894 76.1457 89.2629 92.6054 103.6056 113.5774 115.7235 122.1787 146.0696 179.7726 206.3366 223.8077 232.8102 242.2931 249.6479 265.4644 275.1825 279.2900 287.7196 329.4319 359.8520 370.0909 388.6106 414.8044 433.0137 479.2815 523.8502 534.6201 603.9642 639.3486 673.2273 677.8882 707.8731 732.4439 763.0026 779.3109 786.1785 787.3224 806.5406 810.5592 851.8346 888.4046 897.9431 904.4946 915.6941 923.3869 934.7671 975.0122 976.4043 996.0288 1004.0320 1014.7505 1031.5690 1035.1867 1040.9736 1078.2501 1085.1277 1096.0189 1102.8477 1108.2647 1115.0182 1145.8855 1150.0676 1153.1417 1176.5735 1201.1076 1204.7965 1209.5088 1228.0096 1235.2895 1252.8081 1262.4462 1273.8191 1279.8798 1288.8098 1293.8448 1301.2581 1325.7704 1335.1068 1351.7309 1361.5368 1369.5895 1380.6594 1389.3168 1418.8569 1420.1207 1432.9803 1452.8906 1463.9971 1466.0961 1468.9696 1472.7843 1474.4090 1476.0619 1477.7674 1485.5491 1488.3647 1495.7174 1576.0271 1604.7655 1618.2694 1628.1594 2937.1211 2951.7630 2957.2494 2966.6431 2972.1997 2977.3180 2984.4425 2994.6851 2997.5951 3004.1565 3005.1297 3019.5507 3040.2744 3061.5666 3065.9010 3068.6811 3072.0465 3105.9184 3138.4704 3148.0182 3151.1665 3162.5922 3174.0041 3564.5404
redmass: 4.7238 4.8765 7.0352 5.2544 3.9357 3.4784 2.4198 2.1080 3.4303 3.6039 2.6050 1.4682 2.8824 3.3858 2.6294 4.5233 4.1425 2.0898 2.1977 1.6777 4.9156 2.9212 1.5747 5.5642 1.8629 4.9868 3.3682 6.3525 7.5463 3.7715 2.9137 2.6155 4.3187 4.6483 3.3678 6.4019 6.2215 6.4988 4.1062 1.0833 5.5796 2.3969 1.6094 1.5445 2.8837 1.3971 3.3473 1.6751 1.7926 2.0225 3.6592 3.5881 1.5447 4.0332 1.4829 1.8551 1.3597 1.5832 3.2692 3.0983 8.0079 2.4261 2.1925 2.8405 1.9732 1.5635 1.2725 2.0191 1.4953 1.8417 1.0605 1.4551 1.2890 1.2584 2.5829 1.2876 3.4586 1.2516 1.3059 1.5689 1.1989 1.0812 1.2030 1.3311 1.3951 1.4835 1.5008 1.5781 9.4551 1.2176 1.2618 1.3522 2.1909 1.0516 1.0572 1.0721 1.1285 1.0784 1.0696 2.3282 1.0429 1.0723 1.0822 1.0887 7.1747 6.4426 10.9730 10.7503 1.0551 1.0644 1.0598 1.0616 1.0361 1.0777 1.0989 1.0630 1.0957 1.0293 1.0658 1.0988 1.1013 1.1059 1.1014 1.1007 1.0993 1.1043 1.0860 1.1049 1.0901 1.0950 1.1009 1.0665
irintensity: 0.0541 0.6136 3.0744 0.0728 0.9075 2.6174 6.6703 4.5849 2.4120 0.2241 1.1291 0.0991 1.4736 2.7153 2.2738 1.7504 4.9996 1.0202 0.3255 2.3390 7.5578 20.7819 82.3663 6.7311 50.1325 2.2444 21.2893 4.0170 2.8709 2.9969 0.6007 6.0699 0.0080 7.9972 3.0614 2.0053 1.1553 7.3460 71.4837 10.9425 6.1660 4.4251 18.8615 35.5844 1.5985 5.5847 9.4680 3.8730 12.4106 13.1977 1.4177 3.7000 1.2779 112.1446 12.4380 3.1659 1.9418 10.6921 107.8974 2.0034 81.7585 0.4008 37.7274 202.9780 40.8017 7.5518 1.9295 3.0230 38.7400 1.5010 0.1987 12.9676 1.0535 0.9979 82.3471 10.9018 387.8425 3.0021 2.3539 15.2273 1.3941 1.3461 0.1675 8.9586 11.6587 0.7122 0.1958 0.8427 6.9884 12.1061 17.8256 5.9411 5.3539 8.9913 8.6059 0.3946 7.7581 13.1181 3.0086 1.2362 11.8389 5.0364 7.7066 15.7785 0.6519 46.1099 338.8886 12.8314 52.8276 15.6467 3.4585 83.4583 42.3088 19.2033 35.6676 37.1238 3.0575 32.0451 42.5665 1.4689 62.8747 25.8313 46.9652 86.7721 47.3725 22.2709 1.6241 11.6778 5.0582 5.9622 22.5168 2.6985
temp: 298.150 k
press: 1.00000 atm
elementType: 8 8 8 8 8 6 6 6 6 6 6 6 6 6 6 6 6 6 6 6 6 6 1 1 1 1 1 1 1 1 1 1 1 1 1 1 1 1 1 1 1 1 1 1 1 1
symmnumber: 1
zpe: 997566.3 jmol-1
zpe.correction: 0.379953 hartree
zpe.thermalcorrener: 0.404571 hartree
zpe.thermalcorrenthalpy: 0.405515 hartree
zpe.thermalcorrgfe: 0.322140 hartree
zpe.sumelectzpe: -1036.625284 hartree
zpe.sumelectthermal: -1036.600666 hartree
zpe.sumelectthermalent: -1036.599722 hartree
zpe.sumelectthermalfe: -1036.683097 hartree
dipole: 0.2036 0.9141 1.4267
dipole: 1.7066
quadrupole: -117.2754 -143.7427 -123.4511
quadrupole: 0.9597 -18.0270 2.5054
quadrupole: 10.8810 -15.5863 4.7053 0.9597 -18.0270 2.5054
hfenergy: -1037.0052368 hartree
pointgroup: C01 [X(C17H24O5)]
dipole: 0.0873096 -0.3347858 -0.5754104 debye
polarizability: 243.9730044|-1.8314341|208.0369658|31.9239625|3.2742998|152.3660245 unknown
InChI: InChI=1S/C17H24O5/c1-3-4-7-13(10-11-18)12-22-17(20)15-9-6-5-8-14(15)16(19)21-2/h5-6,8-9,13,18H,3-4,7,10-12H2,1-2H3
charge 0 multiplicity 1
46 atoms
O  0.244594 0.930164 0.301721
O  -5.307965 2.829097 -0.273977
O  1.46883 2.791035 -0.395088
O  1.235759 -0.650398 -1.89905
O  1.290566 -2.579871 -0.593368
C  -2.155271 0.888725 0.745219
C  -2.330689 -0.512199 0.099258
C  -3.454384 1.741668 0.792335
C  -3.390788 -1.407352 0.778418
C  -1.024583 1.680396 0.067874
C  -3.422552 -2.836947 0.190089
C  -4.089825 2.052719 -0.568932
C  -4.477218 -3.741525 0.862994
C  1.426195 1.596462 -0.015613
C  2.623642 0.741343 0.270684
C  2.679989 -0.656521 0.006725
C  3.719476 1.37463 0.906266
C  3.796845 -1.405881 0.451889
C  4.841068 0.626012 1.320915
C  4.870935 -0.771929 1.111029
C  1.657991 -1.398247 -0.799132
C  0.269502 -1.325125 -2.797356
H  -1.842104 0.731676 1.798606
H  -1.353065 -1.030489 0.137939
H  -2.584721 -0.397701 -0.977206
H  -4.212807 1.223099 1.405928
H  -3.246671 2.70394 1.299429
H  -4.398923 -0.954926 0.682343
H  -3.177199 -1.466259 1.866279
H  -0.915585 2.695437 0.492364
H  -1.160812 1.771608 -1.026755
H  -3.62724 -2.777667 -0.899272
H  -2.417688 -3.294209 0.293069
H  -4.347156 1.114335 -1.104732
H  -3.397139 2.644196 -1.205808
H  -5.494479 -3.321841 0.746221
H  -4.27864 -3.840879 1.946821
H  -4.477741 -4.756944 0.425969
H  -5.758869 3.072112 -1.121543
H  3.669166 2.453984 1.08122
H  3.814218 -2.483293 0.259124
H  5.67902 1.127739 1.816052
H  5.730363 -1.36219 1.445723
H  0.110726 -0.614176 -3.620181
H  -0.669987 -1.531573 -2.258299
H  0.692415 -2.27454 -3.166594
