program: Gaussian 09
title: 000187076
version: EM64L-G09RevD.01
frameworkgroup: C1[X(C15H21NO)]
method: RPBEPBE
basis: SDD
operation: Freq
keyword: #p
keyword: freq=noraman
keyword: PBEPBE/SDD
title: #p freq=noraman PBEPBE/SDD
converged: YES YES NO NO
title: Mulliken charges:
elementType: O N C C C C C C C C C C C C C C C H H H H H H H H H H H H H H H H H H H H H
charge: -0.441058 -0.045451 0.183534 -0.080869 -0.461867 -0.501633 -0.473164 0.336453 -0.397389 -0.584241 -0.761693 0.280436 -0.558016 -0.625696 -0.363100 0.264604 -0.430577 0.219218 0.213402 0.192133 0.221642 0.205984 0.206055 0.207432 0.198681 0.203169 0.219169 0.230250 0.221276 0.225987 0.214186 0.250657 0.222689 0.184963 0.221488 0.231084 0.218357 0.351905
chargesum: 0.00000
title: Mulliken charges with hydrogens summed into heavy atoms:
elementType: O N C C C C C C C C C C C C C C C
charge: -0.089153 -0.045451 0.183534 0.138349 -0.056332 -0.074007 -0.059676 0.336453 0.004461 -0.134822 -0.100245 0.280436 -0.307359 0.003445 -0.132016 0.264604 -0.212220
polarizability: 1.89660881e+02 -1.08173448e+01 1.63917937e+02 -1.24500233e+01 -1.16678461e+01 1.39461845e+02
1716.lowfreq: -11.9668 -0.0009 -0.0007 -0.0006 6.6903 22.6227 45.2919 77.1669 127.5677
frequency: 45.1768 77.1277 127.5514 139.6604 171.9197 205.4057 213.0794 235.2118 247.5907 262.2688 284.7481 309.3025 331.4287 339.2257 344.8159 374.0911 382.2097 410.6323 414.2391 461.4195 466.4704 479.5631 496.5798 511.6818 579.1675 614.7859 628.6463 684.5073 705.2739 743.2857 769.3204 794.0394 808.6451 841.9481 880.7216 887.4167 910.1569 927.8460 937.4650 945.7717 974.7576 997.0949 998.8578 1016.0483 1051.5778 1067.4572 1085.1394 1092.1118 1105.2394 1118.2330 1130.6100 1146.4867 1152.3989 1163.9032 1175.3561 1191.9076 1194.1420 1204.4965 1220.5002 1242.5584 1250.2641 1266.0403 1284.0594 1294.0139 1305.5488 1330.1430 1340.7557 1347.1462 1354.1816 1359.1684 1377.1306 1380.9152 1385.9284 1429.2274 1439.6508 1457.4967 1460.8737 1461.6136 1462.9759 1468.2113 1469.5958 1480.6412 1482.3272 1490.0726 1493.9068 1586.0215 1629.9477 2836.5769 2838.1226 2855.1180 2959.1991 2970.6105 2978.8566 2990.2894 2992.7180 3006.7548 3011.8129 3014.8942 3023.2339 3043.1322 3047.7322 3065.0438 3073.9985 3081.8259 3105.2088 3129.2244 3157.6644 3580.5139
redmass: 4.1319 3.9506 3.0205 2.4308 2.9835 2.8887 1.2252 1.9836 1.6052 2.4514 2.3174 2.1125 2.9694 1.1454 2.2811 2.5097 3.1147 3.7234 3.7003 2.9981 2.8656 2.8346 4.3801 3.4405 2.8250 2.8548 3.5320 5.7203 2.8133 3.3824 2.3219 1.4286 2.8537 2.1718 2.1203 1.6504 2.3242 1.4654 2.1929 2.1889 1.7602 1.7081 1.7945 1.9491 2.1607 2.2242 1.9326 1.9803 1.6164 1.8169 1.9771 1.4594 1.5722 1.9604 1.7850 1.1098 1.5896 1.7510 2.1719 2.8102 1.9828 1.5017 1.5264 1.4793 1.7741 1.3994 1.5456 1.4651 1.4392 1.3853 1.4435 3.5787 1.3567 1.1790 2.6611 1.1344 1.0783 1.0901 1.0563 1.0948 1.0739 1.1069 1.0588 1.1125 2.4359 7.0406 6.4742 1.0688 1.0652 1.0627 1.0635 1.0363 1.0745 1.0649 1.0696 1.0902 1.0920 1.0719 1.0871 1.1013 1.1004 1.0991 1.1010 1.0984 1.0865 1.0969 1.0901 1.0660
irintensity: 0.0812 0.4401 2.9930 0.1827 1.8960 1.3091 0.2189 2.1557 1.5848 1.5217 1.7418 0.9623 1.3599 136.6540 4.8964 3.9215 2.2903 3.5512 3.2776 0.4414 10.3020 2.8236 0.8529 2.2431 2.5481 0.8715 3.4382 0.3745 8.9013 6.5277 4.9058 40.3721 1.3705 7.5253 23.4945 17.9327 24.2565 1.0757 13.2335 11.8935 0.9540 5.9408 1.6299 4.8039 9.3595 12.0791 7.0315 2.8279 23.8908 1.2832 27.6797 26.2764 148.6649 6.4465 5.6212 6.8220 11.7071 8.9807 4.4007 7.6491 1.2246 15.0538 26.5591 12.4543 16.9105 0.7953 0.9673 3.7078 2.4929 3.7788 3.6522 16.3661 9.3931 0.9635 3.8417 1.4186 1.6563 13.9140 26.1582 12.3902 24.5842 12.2388 3.2874 11.5308 77.3936 31.9796 52.1584 42.8934 48.3527 193.2237 27.2464 24.1027 21.5595 22.4334 54.7649 38.9198 74.2690 55.4424 67.5225 47.4248 26.8119 51.4111 33.0597 34.0345 15.7738 27.7352 5.0951 32.5785
temp: 298.150 k
press: 1.00000 atm
elementType: 8 7 6 6 6 6 6 6 6 6 6 6 6 6 6 6 6 1 1 1 1 1 1 1 1 1 1 1 1 1 1 1 1 1 1 1 1 1
symmnumber: 1
zpe: 862326.1 jmol-1
zpe.correction: 0.328443 hartree
zpe.thermalcorrener: 0.343933 hartree
zpe.thermalcorrenthalpy: 0.344877 hartree
zpe.thermalcorrgfe: 0.287418 hartree
zpe.sumelectzpe: -712.870514 hartree
zpe.sumelectthermal: -712.855024 hartree
zpe.sumelectthermalent: -712.854080 hartree
zpe.sumelectthermalfe: -712.911539 hartree
dipole: 0.8134 1.1727 -1.3495
dipole: 1.9642
quadrupole: -95.4157 -101.6337 -101.4493
quadrupole: 0.4176 -4.5063 -0.3044
quadrupole: 4.0839 -2.1341 -1.9498 0.4176 -4.5063 -0.3044
hfenergy: -713.198957 hartree
pointgroup: C01 [X(C15H21N1O1)]
dipole: 0.3343263 -0.4687922 0.5153838 debye
polarizability: 190.0038268|10.5416701|164.5083922|11.6800159|-11.32619|138.5284446 unknown
InChI: InChI=1S/C15H21NO/c1-15-7-8-16(2)10-12(15)5-3-11-4-6-13(17)9-14(11)15/h4,6,9,12,17H,3,5,7-8,10H2,1-2H3
charge 0 multiplicity 1
38 atoms
O  3.722191 2.054256 0.026692
N  -2.884803 0.873636 0.600953
C  -0.623486 -0.027708 -1.155364
C  -1.683002 -1.007943 -0.545711
C  -1.273648 1.389782 -1.204814
C  -1.088659 -2.420414 -0.343817
C  -2.279695 -0.466483 0.776412
C  0.693346 -0.073866 -0.344838
C  -1.862829 1.844212 0.140695
C  0.102935 -2.402385 0.63975
C  -0.287697 -0.438306 -2.623448
C  1.043476 -1.215359 0.440841
C  1.624209 0.988658 -0.453503
C  -3.581733 1.330499 1.818016
C  2.302431 -1.240025 1.090309
C  2.870149 0.942232 0.201033
C  3.223508 -0.179353 0.986255
H  -2.519148 -1.068623 -1.271764
H  -2.097686 1.353865 -1.944002
H  -0.550383 2.142892 -1.568224
H  -0.759695 -2.820317 -1.320894
H  -1.870407 -3.109111 0.03241
H  -3.068458 -1.162679 1.122652
H  -1.488564 -0.440913 1.570853
H  -1.042308 1.962458 0.896285
H  -2.346921 2.832076 0.021999
H  0.675921 -3.346017 0.550882
H  -0.279862 -2.381076 1.680798
H  0.364898 0.320483 -3.093456
H  0.24331 -1.404627 -2.673085
H  -1.21396 -0.516127 -3.224477
H  1.405175 1.876472 -1.053898
H  -4.061772 2.307374 1.627654
H  -2.902254 1.447264 2.702051
H  -4.371576 0.607011 2.089739
H  2.567902 -2.117018 1.694425
H  4.192618 -0.227277 1.500036
H  4.568972 1.923356 0.521254
