program: Gaussian 09
title: 000187060
version: EM64L-G09RevD.01
frameworkgroup: C1[X(C11H11NO3)]
method: RPBEPBE
basis: SDD
operation: Freq
keyword: #p
keyword: freq=noraman
keyword: PBEPBE/SDD
title: #p freq=noraman PBEPBE/SDD
converged: YES YES NO NO
title: Mulliken charges:
elementType: O O O N C C C C C C C C C C C H H H H H H H H H H H
charge: -0.276176 -0.418846 -0.227825 -0.379247 0.131214 0.276145 0.146028 -0.355480 -0.387551 -0.236135 -0.440074 -0.230878 -0.260391 0.211094 -0.575789 0.274379 0.244238 0.343639 0.265783 0.297344 0.236027 0.232134 0.297405 0.222197 0.224735 0.386029
chargesum: 0.00000
title: Mulliken charges with hydrogens summed into heavy atoms:
elementType: O O O N C C C C C C C C C C C
charge: -0.276176 -0.032817 -0.227825 -0.035608 0.131214 0.276145 0.146028 -0.081101 -0.143313 -0.000108 0.123053 0.001257 0.037014 0.211094 -0.128856
polarizability: 1.84409308e+02 -8.10498847e+00 1.59767688e+02 -3.19110434e+00 4.44471150e+00 7.14844249e+01
1716.lowfreq: 0.0007 0.0010 0.0011 0.3001 7.4074 9.3940 27.3782 34.7694 53.0551
frequency: 27.3456 34.7093 53.0069 63.2196 100.3471 114.9722 170.3672 210.0341 269.6226 271.9880 293.4305 314.8549 373.8069 424.7334 460.9006 481.9618 495.3830 543.9301 576.4944 578.0248 615.1445 646.0054 659.3504 664.5891 703.0873 762.7358 783.8156 788.7343 803.2186 825.7338 895.8864 943.1490 972.3347 989.9478 1000.0444 1021.0686 1033.3971 1048.4270 1065.5987 1077.6559 1092.5346 1168.2899 1176.3535 1211.7366 1240.8557 1263.5075 1284.6687 1302.6676 1314.4860 1334.1215 1370.5936 1426.6153 1431.9833 1434.3949 1470.4352 1493.2181 1564.6893 1589.1825 1609.8594 1634.4020 1664.9321 2992.4398 3052.6176 3095.5983 3110.9687 3130.6376 3144.1985 3156.8406 3170.4789 3203.6921 3512.4859 3539.1933
redmass: 4.9309 10.3439 5.9327 5.9932 3.2574 4.0691 4.5575 3.3937 3.5182 4.1141 3.0640 5.0152 5.5431 2.6633 3.6597 3.1425 2.8153 4.0448 2.0971 3.6095 1.7476 2.1746 1.7404 2.6866 2.9147 4.0048 1.7983 2.4390 5.3532 4.1728 1.4512 1.3439 1.3924 3.0414 1.3605 1.8259 1.2500 2.1567 2.3106 2.3013 2.3930 2.3732 1.0729 2.0397 1.1777 1.9876 1.7232 2.4848 1.2792 1.3436 6.4112 1.3335 1.2480 1.7907 2.2695 2.0487 5.7841 6.1554 6.3675 4.3317 9.0911 1.0603 1.0990 1.0597 1.0930 1.0855 1.0898 1.0948 1.1001 1.1143 1.0639 1.0789
irintensity: 0.5170 2.0037 4.7073 2.7251 1.6385 2.6499 1.4011 1.9875 5.3821 1.5342 4.7236 6.4352 6.9032 4.6101 13.6637 16.0381 17.1141 36.4712 15.9176 3.5895 133.4153 65.2493 29.9438 40.3021 25.5267 9.8048 46.2591 16.0655 21.7279 14.0969 0.4595 67.1768 2.6380 20.3200 2.3705 6.8076 7.8168 2.1668 29.7058 137.9719 26.6106 21.1390 0.4298 5.6678 13.8925 141.9931 40.0040 33.6690 0.3165 11.6610 3.1747 9.9723 13.7464 9.9967 20.4202 196.3801 16.0014 153.7242 19.1054 10.9367 324.8870 53.5451 5.1258 4.0511 2.7104 0.9664 9.4206 13.8176 21.9061 16.5146 29.9522 31.3214
temp: 298.150 k
press: 1.00000 atm
elementType: 8 8 8 7 6 6 6 6 6 6 6 6 6 6 6 1 1 1 1 1 1 1 1 1 1 1
symmnumber: 1
zpe: 522455.5 jmol-1
zpe.correction: 0.198993 hartree
zpe.thermalcorrener: 0.213068 hartree
zpe.thermalcorrenthalpy: 0.214012 hartree
zpe.thermalcorrgfe: 0.156134 hartree
zpe.sumelectzpe: -705.110417 hartree
zpe.sumelectthermal: -705.096342 hartree
zpe.sumelectthermalent: -705.095398 hartree
zpe.sumelectthermalfe: -705.153276 hartree
dipole: 2.0808 3.6440 1.3726
dipole: 4.4150
quadrupole: -87.7056 -85.1727 -87.8258
quadrupole: -6.0476 2.3747 -4.1727
quadrupole: -0.8042 1.7286 -0.9244 -6.0476 2.3747 -4.1727
hfenergy: -705.3094099 hartree
pointgroup: C01 [X(C11H11N1O3)]
dipole: 0.877912 1.3148502 0.7194682 debye
dipolederiv: -0.7728755 -0.2229449 -0.0894593 -0.0445431 -0.7981007 -0.3222716 0.1166667 -0.257681 -0.5603936 -0.5527615 -0.2738991 0.1793176 -0.3662393 -0.7722592 0.2630686 0.2104583 0.2743093 -0.5440688 -1.2776051 -0.1077619 0.0880195 0.1599376 -0.482041 0.0998002 -0.0759713 0.1020822 -0.3895363 -1.0783018 0.1734368 0.217634 0.1441037 -0.5495208 -0.0397843 0.2933613 -0.0713227 -0.5636087 -0.3637761 -0.0772745 -0.0089392 -0.0772575 -0.0487859 -0.0406392 -0.0909955 -0.0055708 -0.0357092 0.0337207 -0.0618651 -0.0313077 0.0508981 0.1041784 -0.0089227 0.0468134 0.0465474 0.0008181 1.5098439 0.1260078 -0.1852034 -0.1358477 0.8805438 0.5749408 -0.3857752 0.4704524 0.6681178 -0.0606125 0.1384828 0.028971 -0.0599087 0.0410653 0.0057945 -0.0444098 0.0219 -0.116391 -0.1887516 0.0985461 0.0162235 0.0974356 0.0056319 -0.0179371 0.0201383 -0.0191986 -0.1455523 0.0029425 -0.1456472 -0.0079335 -0.0958037 -0.0271367 0.0043995 0.0016449 0.0074692 -0.1593911 0.5190095 0.0395759 -0.0719529 0.4214258 -0.093781 -0.0188032 0.0052103 0.0074771 0.1501275 0.1361839 0.0287394 0.017575 -0.0005767 0.0032566 0.014544 0.010598 0.0161051 -0.1306298 0.0649094 -0.1765081 0.0630818 -0.0988406 0.1244507 0.0929111 0.1340629 0.0271862 -0.0638247 1.5636332 0.1935222 -0.1415272 0.010021 0.9702841 -0.4843923 -0.0414323 -0.4811972 0.5094952 -0.0586874 -0.0364724 0.2216656 -0.0181947 -0.2288368 0.0516242 0.221604 0.0087202 -0.2189767 0.1207747 -0.0577892 -0.0061272 -0.0261753 -0.0124284 -0.0114824 0.019107 -0.0262913 0.1487922 0.0667935 -0.0227119 -0.0071591 -0.0739172 -0.0778408 -0.0060569 -0.0241381 0.0001944 0.1426787 0.1737774 0.0336293 0.0133085 -0.0030809 0.2301112 -0.0946839 -0.0253299 -0.1183117 0.2615779 -0.0815492 0.0088544 0.0574125 -0.0161636 0.1314047 0.018289 0.0644962 0.0513759 -0.0288802 0.1842488 0.0338554 -0.0204116 -0.13138 0.1108042 -0.0174801 -0.1332108 -0.0295914 0.1060038 -0.0221935 0.0978586 0.0019846 0.1110227 -0.0197139 -0.0125499 -0.0016454 -0.011252 0.1598621 -0.1217959 -0.0269274 -0.0151785 -0.0499966 0.0783646 -0.0072836 -0.0125622 -0.0029841 0.1549121 0.0630736 0.0555694 -0.0646858 0.0199429 0.0570793 -0.051099 -0.0912212 -0.0244727 0.0862088 0.0304063 0.1149895 -0.0529358 0.1067556 -0.0278669 -0.0205656 -0.055372 0.0109686 0.1406555 -0.0141865 -0.0121191 -0.1341243 0.0202994 0.1067249 -0.0253469 -0.1229585 -0.0362408 0.0782073 0.1237792 0.078853 -0.0682481 0.056083 0.2944124 0.0539267 -0.0391391 0.0393264 0.3495056 unknown
polarizability: 183.4565123|-9.7365348|158.8532545|0.4016807|13.6519682|73.3516542 unknown
InChI: InChI=1S/C11H11NO3/c1-2-8-5-3-4-6-9(8)11(15)12-7-10(13)14/h2-6,12-13H,1,7H2
charge 0 multiplicity 1
26 atoms
O  -0.666122 -2.227795 -0.791648
O  -2.846388 1.221271 -0.753211
O  -4.814465 0.184225 -0.081613
N  -1.254121 -0.494667 0.636752
C  1.111183 -0.745323 -0.04055
C  1.5277 0.619756 0.092339
C  -0.324717 -1.202745 -0.120019
C  2.080923 -1.778986 -0.100719
C  2.922954 0.885336 0.196058
C  3.455227 -1.493479 0.011534
C  -2.669301 -0.824003 0.575542
C  3.875945 -0.15158 0.170995
C  0.566741 1.754202 0.049882
C  -3.566701 0.212667 -0.097261
C  0.725571 2.940432 0.701412
H  1.72618 -2.805288 -0.238416
H  3.256814 1.92716 0.249785
H  -0.950366 0.320393 1.172578
H  -3.094613 -1.018851 1.577165
H  -2.750367 -1.765894 -0.002977
H  4.19067 -2.303661 -0.031524
H  4.942729 0.086245 0.247234
H  -0.329189 1.617846 -0.571322
H  -0.005571 3.747943 0.588372
H  1.573369 3.133584 1.369818
H  -3.490187 1.837414 -1.198407
