program: Gaussian 09
title: 000184908
version: EM64L-G09RevD.01
frameworkgroup: C1[X(C6H4Cl3N)]
method: RPBEPBE
basis: SDD
operation: Freq
keyword: #p
keyword: freq=noraman
keyword: PBEPBE/SDD
title: #p freq=noraman PBEPBE/SDD
converged: NO NO NO NO
title: Mulliken charges:
elementType: Cl Cl Cl N C C C C C C H H H H
charge: -0.020077 -0.055531 -0.014289 -0.676297 0.706828 -0.227925 -0.312235 -0.091246 -0.221505 -0.262921 0.258062 0.263425 0.327158 0.326555
chargesum: 0.00000
title: Mulliken charges with hydrogens summed into heavy atoms:
elementType: Cl Cl Cl N C C C C C C
charge: -0.020077 -0.055531 -0.014289 -0.022585 0.706828 -0.227925 -0.312235 -0.091246 0.036556 0.000503
polarizability: 1.44480504e+02 -2.64877519e+00 1.14675877e+02 -9.12984792e-06 -8.38940153e-04 3.69446421e+01
1716.lowfreq: -0.0045 -0.0036 -0.0034 4.2858 5.7297 12.0861 94.6221 103.4700 190.7111
frequency: 94.6201 103.4590 190.7109 201.5723 252.2204 290.0299 294.8625 314.3950 375.1228 464.4388 473.0058 479.5068 499.0823 565.0754 569.1708 578.8217 723.4178 740.3106 772.7963 886.6090 916.5364 1041.8880 1065.1210 1124.3066 1186.3432 1279.4202 1379.6086 1423.6198 1474.1419 1551.6353 1589.8065 1630.4544 3167.8605 3188.3890 3542.0518 3688.0906
redmass: 11.3765 8.3765 29.8877 17.9360 5.1243 6.6071 5.7364 14.5083 11.3610 5.3662 1.0879 1.1564 4.5092 5.1113 4.8435 7.8236 9.2728 7.4245 1.3226 6.5778 1.3262 4.5303 1.9193 1.6104 1.6880 2.2853 6.3131 3.6436 4.8042 7.1530 2.2981 1.9096 1.0890 1.0975 1.0446 1.1046
irintensity: 0.0685 0.5385 0.0559 1.3852 14.7103 1.0399 2.8245 0.5325 2.9032 20.7311 74.6777 209.7016 0.1155 10.5070 15.6910 2.6310 6.7384 27.8225 53.3353 54.5071 0.2284 82.8377 63.2894 2.3680 6.0246 3.3825 45.6392 27.6501 108.6916 2.6915 0.8769 298.3542 0.6616 0.2032 86.4555 51.6614
temp: 298.150 k
press: 1.00000 atm
elementType: 17 17 17 7 6 6 6 6 6 6 1 1 1 1
symmnumber: 1
zpe: 227999.3 jmol-1
zpe.correction: 0.086840 hartree
zpe.thermalcorrener: 0.096388 hartree
zpe.thermalcorrenthalpy: 0.097333 hartree
zpe.thermalcorrgfe: 0.051179 hartree
zpe.sumelectzpe: -1665.252561 hartree
zpe.sumelectthermal: -1665.243012 hartree
zpe.sumelectthermalent: -1665.242068 hartree
zpe.sumelectthermalfe: -1665.288222 hartree
dipole: -1.7899 0.7233 -0.0004
dipole: 1.9305
quadrupole: -82.3385 -66.4202 -81.8759
quadrupole: -3.1274 0.0007 -0.0015
quadrupole: -5.4603 10.4580 -4.9977 -3.1274 0.0007 -0.0015
hfenergy: -1665.3394009 hartree
pointgroup: C01 [X(C6H4Cl3N1)]
dipole: 0.7221476 0.2352837 0.0001561 debye
dipolederiv: -0.2564065 0.238905 0.0000091 0.2928866 -0.5188169 -0.0000221 0.000017 -0.000016 -0.0247642 -0.7969644 0.0251645 -0.0000135 -0.0279742 -0.1385109 -0.0000045 -0.0000119 0.0000032 -0.0539898 -0.7343479 -0.085281 -0.0000081 -0.0548454 -0.079812 -0.0000021 -0.0000142 -0.0000023 -0.0383224 -0.476638 -0.5097898 0.0000327 -0.5465036 -1.1487182 0.0000855 0.0001109 0.0002122 -0.6754453 0.0061333 0.7071741 -0.0000401 0.6858736 0.9324626 -0.0000952 -0.0000389 -0.0000765 0.1882584 0.0384627 -0.8661388 -0.0000156 -0.2955373 0.4769282 0.0000463 -0.000022 0.0000359 -0.1140821 1.0988537 0.0980551 0.0000282 -0.3381816 -0.1735427 0.0000236 0.0000138 0.0000025 -0.1405999 1.0406079 0.3235844 0.000018 -0.0970168 0.2599658 -0.0000088 0.000021 -0.0000043 -0.0053805 0.0520316 -0.0193168 -0.0000124 0.2319476 0.0710958 -0.0000058 0.0000005 -0.0000015 -0.0644942 -0.4719509 -0.0192057 0.0000066 0.045208 -0.2218968 0.0000118 0.0000046 0.0000114 -0.1776387 0.0437512 0.0692338 -0.0000005 0.0599807 0.0204137 -0.0000034 0.0000015 -0.0000038 0.1662426 0.0430083 -0.0412672 -0.0000037 -0.0358857 0.0033139 -0.0000075 -0.0000085 -0.0000124 0.1823063 0.2199447 0.0546563 -0.0000169 0.0331602 0.2464966 -0.0000012 -0.0000622 -0.0000576 0.3793212 0.1935143 0.0242261 0.0000163 0.0468879 0.2706208 -0.0000167 -0.0000115 -0.0000907 0.3785887 unknown
polarizability: 144.7032924|0.571194|114.453089|0.0000488|0.0008376|36.9446421 unknown
InChI: InChI=1S/C6H4Cl3N/c7-3-1-2-4(8)6(10)5(3)9/h1-2H,10H2
charge 0 multiplicity 1
14 atoms
Cl -1.680127 2.209156 0.000082
Cl 3.255273 -0.360298 0.000038
Cl -3.167292 -0.70918 -0.000025
N  1.334213 2.003293 -0.000081
C  0.702269 0.7752 -0.000005
C  -0.722291 0.662233 0.000018
C  1.42922 -0.452732 0.000001
C  -1.357304 -0.592945 0.0000
C  0.802618 -1.706139 -0.000016
C  -0.607456 -1.787028 -0.000031
H  1.404989 -2.61853 -0.000031
H  -1.114274 -2.754545 -0.000076
H  2.350645 2.046443 0.000044
H  0.784816 2.859174 0.000079
