program: Gaussian 09
title: 000187099
version: EM64L-G09RevD.01
frameworkgroup: C1[X(C18H16N2O4)]
method: RPBEPBE
basis: SDD
operation: Freq
keyword: #p
keyword: freq=noraman
keyword: PBEPBE/SDD
title: #p freq=noraman PBEPBE/SDD
converged: YES YES NO NO
title: Mulliken charges:
elementType: O O O O N N C C C C C C C C C C C C C C C C C C H H H H H H H H H H H H H H H H
charge: -0.268220 -0.290905 -0.278305 -0.203808 -0.070434 0.001796 -0.092455 0.372959 0.323064 -0.365945 -0.346014 -0.717897 0.126827 -0.385178 -0.317359 0.064240 0.191936 0.240541 -0.339056 -0.308035 -0.428368 -0.210992 -0.226059 -0.506099 0.242712 0.218586 0.242820 0.252397 0.256974 0.264630 0.260402 0.313830 0.253121 0.260875 0.266592 0.233762 0.235641 0.245703 0.235892 0.249831
chargesum: 0.00000
title: Mulliken charges with hydrogens summed into heavy atoms:
elementType: O O O O N N C C C C C C C C C C C C C C C C C C
charge: -0.268220 -0.290905 -0.278305 -0.203808 -0.070434 0.001796 0.150257 0.372959 0.323064 -0.108971 -0.081384 -0.004095 0.126827 -0.124777 -0.003529 0.064240 0.191936 0.240541 -0.085934 -0.047161 -0.161776 0.022770 0.009582 0.225327
polarizability: 3.66871891e+02 4.45000301e+01 2.54493777e+02 8.68289661e+00 -2.34870625e+01 1.16951588e+02
1716.lowfreq: -7.2717 -4.2448 -0.0003 -0.0001 0.0007 2.0205 15.0945 22.4979 26.3509
frequency: 15.0071 22.4168 26.3295 40.1279 50.4212 62.8948 83.9124 95.3734 121.6672 140.9823 171.3139 177.5409 200.0048 204.9399 220.0530 241.3675 274.3298 290.2845 305.7718 314.2340 368.5179 384.2170 412.9039 416.7353 421.7699 487.2203 487.6210 515.7296 518.7109 531.7054 537.5877 571.9532 607.9659 628.2390 653.7875 663.3388 685.7972 707.1215 714.6785 748.7128 763.4672 772.9010 789.2843 799.9185 820.8796 822.6665 837.6647 879.0555 891.7195 897.8417 901.5640 939.8896 954.2372 966.3407 967.0284 969.9706 995.5445 1001.6221 1013.7779 1029.3025 1079.3858 1101.2473 1106.1982 1112.6207 1113.6440 1142.5572 1144.7639 1148.2398 1156.7658 1185.7046 1191.2874 1209.3459 1238.0864 1266.0398 1284.5664 1299.9332 1319.5688 1326.5727 1347.5713 1370.5308 1379.7755 1389.7600 1408.6282 1420.6841 1423.1575 1452.3866 1454.4712 1461.3783 1463.2798 1473.7030 1474.6569 1483.9558 1522.0897 1554.3204 1589.7481 1613.9074 1616.0778 1662.3377 3002.5500 3007.6379 3017.3945 3104.3553 3111.3796 3117.3737 3135.8005 3150.0367 3151.7970 3153.7865 3158.2225 3159.4972 3164.1023 3174.6047 3179.7956 3206.7404
redmass: 5.1627 5.5680 5.1000 6.4341 4.7665 4.0478 1.0796 5.0644 4.7434 4.6827 5.2948 4.5494 2.6648 5.0005 1.8499 2.1179 4.0652 6.1201 6.2900 4.5843 7.5196 5.0610 4.0030 5.6682 3.2534 4.7853 4.5630 2.9377 5.8177 6.9932 3.7951 7.5777 8.2619 6.9569 3.8909 3.4353 7.4900 6.0830 4.3227 5.7256 5.1518 1.3834 3.2589 3.6052 1.2714 6.3904 1.6063 1.5893 6.7139 1.4500 5.1202 3.7686 1.3377 5.4597 1.3792 1.3370 1.3238 2.8063 2.0490 2.2571 2.0703 3.0930 1.8706 1.3158 1.3300 2.3219 1.9982 1.4394 1.3085 1.4324 1.9401 3.6493 3.2032 1.9776 2.4763 1.4020 1.3152 1.4101 3.9223 2.8167 5.0389 1.2314 4.8896 1.2396 3.1391 1.0501 2.8240 1.0447 1.0528 1.0543 3.4818 2.5928 8.1747 6.9362 8.0639 6.3798 6.6114 9.2532 1.0351 1.0295 1.0850 1.0998 1.1048 1.1015 1.0859 1.0896 1.0927 1.1051 1.0902 1.0887 1.0957 1.1005 1.0975 1.0943
irintensity: 0.1221 0.1501 1.9639 0.0301 0.2567 0.2936 0.1750 0.2689 0.9167 1.1039 1.7717 4.9218 2.9810 1.9793 2.3614 1.4797 7.0495 5.0516 3.9113 5.6567 0.5915 0.6801 8.5535 8.2338 2.0732 0.8957 1.1104 14.8673 2.7531 4.1543 3.2490 0.4999 29.9851 2.2512 11.0302 1.6072 15.5338 4.2294 0.4312 15.7440 5.0959 77.8089 6.5247 10.4381 0.1387 6.7597 101.9245 1.8049 5.6914 20.7107 27.0856 28.1477 0.9976 18.3147 2.2156 5.0553 0.0051 28.5378 9.6438 50.3713 158.7407 95.4744 1.3305 50.5836 20.0851 11.2610 13.4319 10.0904 36.1993 122.9216 151.0100 274.3021 97.8556 140.3998 40.9535 19.0938 2.3452 23.7407 214.0360 3.4426 2.8524 28.1081 63.5390 9.9666 12.2033 15.6028 25.6796 15.0999 7.8781 13.2393 37.6284 412.5790 224.3530 4.4782 7.7256 31.9288 5.3433 136.6097 15.8653 25.6239 16.0325 17.4934 24.8996 12.9796 2.0031 6.4673 5.8075 12.5963 5.7180 2.1284 15.6204 26.1855 4.1050 11.5303
temp: 298.150 k
press: 1.00000 atm
elementType: 8 8 8 8 7 7 6 6 6 6 6 6 6 6 6 6 6 6 6 6 6 6 6 6 1 1 1 1 1 1 1 1 1 1 1 1 1 1 1 1
symmnumber: 1
zpe: 796246.3 jmol-1
zpe.correction: 0.303274 hartree
zpe.thermalcorrener: 0.324779 hartree
zpe.thermalcorrenthalpy: 0.325723 hartree
zpe.thermalcorrgfe: 0.249393 hartree
zpe.sumelectzpe: -1104.186235 hartree
zpe.sumelectthermal: -1104.164730 hartree
zpe.sumelectthermalent: -1104.163786 hartree
zpe.sumelectthermalfe: -1104.240116 hartree
dipole: -0.5993 3.9722 -1.6991
dipole: 4.3617
quadrupole: -130.6554 -119.4944 -144.7916
quadrupole: 0.7665 7.3986 -0.0342
quadrupole: 0.9917 12.1527 -13.1444 0.7665 7.3986 -0.0342
hfenergy: -1104.4895089 hartree
pointgroup: C01 [X(C18H16N2O4)]
dipole: 0.3251015 1.6801443 -0.1271215 debye
polarizability: 355.3629565|-35.1665705|246.0617916|50.8174283|-50.2360599|136.8925081 unknown
InChI: InChI=1S/C18H16N2O4/c1-12(18(21)22-2)23-13-7-9-14(10-8-13)24-17-11-19-15-5-3-4-6-16(15)20-17/h3-12H,1-2H3
charge 0 multiplicity 1
40 atoms
O  4.099635 -0.878741 1.480917
O  -1.397355 -1.796364 0.647202
O  4.462449 1.984438 -0.565004
O  5.303704 -0.112085 -1.152543
N  -2.328271 0.294703 -0.071396
N  -4.843415 -1.10704 -0.210283
C  4.77085 0.405007 1.225712
C  2.71689 -0.978854 1.220692
C  -0.033406 -1.408674 0.810174
C  2.15285 -2.250903 1.490464
C  1.900199 0.073259 0.744522
C  6.172092 0.269904 1.833353
C  -3.493764 0.952099 -0.46679
C  0.781753 -2.464904 1.284801
C  0.515878 -0.137621 0.537524
C  -4.757692 0.2510 -0.537702
C  -2.451536 -1.000529 0.234244
C  4.875723 0.676767 -0.287811
C  -3.443149 2.336085 -0.806611
C  -5.932332 0.947227 -0.945207
C  -3.713425 -1.711427 0.166285
C  -4.610817 2.999353 -1.203911
C  -5.859367 2.305918 -1.274524
C  4.574695 2.405465 -1.985757
H  4.20862 1.232263 1.698614
H  6.743391 1.205407 1.700571
H  6.086955 0.055452 2.91147
H  6.714752 -0.556068 1.34471
H  2.803359 -3.051092 1.854316
H  2.312907 1.061799 0.522347
H  0.326472 -3.439329 1.483579
H  -0.125455 0.665023 0.175103
H  -2.480036 2.852242 -0.746417
H  -6.871955 0.387751 -0.988414
H  -3.747432 -2.77341 0.4287
H  -4.570279 4.06277 -1.464167
H  -6.760138 2.844071 -1.587879
H  5.618539 2.310271 -2.32835
H  4.245115 3.45334 -1.995938
H  3.926099 1.775127 -2.616497
