program: Gaussian 09
title: 000187052
version: EM64L-G09RevD.01
frameworkgroup: C1[X(C9H16N2O4)]
method: RPBEPBE
basis: SDD
operation: Freq
keyword: #p
keyword: freq=noraman
keyword: PBEPBE/SDD
title: #p freq=noraman PBEPBE/SDD
converged: YES YES NO NO
title: Mulliken charges:
elementType: O O O O N N C C C C C C C C C H H H H H H H H H H H H H H H H
charge: -0.205053 -0.414080 -0.283319 -0.229146 -0.056212 0.041186 -0.412953 -0.378385 -0.346231 -0.353192 -0.487363 -0.477499 0.224325 0.184844 -0.767796 0.245808 0.210450 0.210657 0.245326 0.238973 0.250909 0.235843 0.235617 0.231226 0.237859 0.242424 0.262215 0.243823 0.230962 0.258228 0.380553
chargesum: 0.00000
title: Mulliken charges with hydrogens summed into heavy atoms:
elementType: O O O O N N C C C C C C C C C
charge: -0.205053 -0.033527 -0.283319 -0.229146 -0.056212 0.041186 0.043305 0.077598 0.143651 0.118268 -0.018278 0.027140 0.224325 0.184844 -0.034783
polarizability: 1.49471995e+02 -3.60901076e+00 1.28684700e+02 -2.13173767e+00 -3.61559753e+00 9.73464990e+01
1716.lowfreq: -9.3277 -7.2733 -5.5975 -0.0007 -0.0006 0.0002 17.8163 21.5884 23.2800
frequency: 17.6945 21.5068 23.2506 37.8148 57.4402 74.7192 82.9470 93.8533 95.9124 102.0182 116.7815 162.0977 240.0597 250.0145 258.6285 324.6665 341.3450 382.9139 386.1673 458.3864 464.8624 501.8518 515.4649 583.6312 595.9995 651.6040 672.8877 724.1197 750.9124 793.4256 802.7191 848.9141 864.1524 879.7279 941.3201 950.1438 988.0527 1034.5013 1045.1473 1058.4508 1068.4578 1073.6483 1081.0506 1123.9962 1148.6791 1169.7214 1215.0025 1233.5703 1243.2989 1260.9056 1273.4327 1286.8120 1294.2728 1305.1627 1328.7967 1343.9465 1345.3039 1363.6662 1366.8140 1369.7126 1378.7433 1430.5958 1438.3978 1443.2905 1443.6324 1456.1834 1459.0543 1473.3915 1481.1736 1638.7893 1668.0007 2951.1989 2961.4979 2978.1102 2980.1946 2985.1908 3005.2200 3009.9263 3025.4946 3048.4816 3049.5201 3058.9641 3066.2446 3083.0374 3091.3491 3120.2622 3510.5337
redmass: 7.6928 4.6621 7.8650 4.6529 5.0259 2.4566 1.3911 2.5659 2.6649 1.8030 2.5371 4.6074 5.0118 4.4938 4.8322 4.1049 3.9384 3.0719 4.0629 2.5678 2.5519 3.9058 2.4821 4.0525 3.3038 1.4606 2.6387 1.3193 1.1768 3.5215 1.7141 1.5192 3.8591 4.3890 1.6687 1.7724 2.5864 3.0199 3.3943 2.8706 2.4014 2.6919 2.1275 1.8165 1.4053 2.1030 1.6610 1.8365 1.5503 1.3991 1.3556 1.2011 1.4023 1.3590 3.3345 1.3399 1.5403 1.4826 1.7453 1.2508 1.6612 1.0992 1.0961 1.0842 1.0671 1.0581 1.0778 1.0857 1.0917 7.8422 8.3995 1.0623 1.0659 1.0661 1.0383 1.0583 1.0949 1.0603 1.0598 1.0958 1.1008 1.0950 1.0951 1.1027 1.1046 1.1004 1.0639
irintensity: 2.1724 6.8288 0.6994 3.5344 2.4348 1.1039 0.5251 0.0605 0.2689 0.5021 2.2713 3.3489 2.3177 1.2548 1.7332 4.1830 10.0121 3.0214 1.2679 9.9811 16.5915 18.7199 48.1306 5.7951 17.1340 117.6686 4.7963 8.1304 17.1746 5.2312 7.3486 4.4299 9.9106 16.0019 8.3042 11.5338 184.4051 111.8522 4.7803 31.5594 3.5931 17.1005 82.5208 51.4496 12.7172 54.5457 42.8685 1.0703 3.0714 53.5375 5.1367 18.1295 10.5905 32.6628 141.0234 3.0966 34.2352 4.3421 17.6088 58.3335 19.2067 5.9015 25.4816 16.1651 25.9250 17.2341 5.9238 16.2132 18.3729 100.5653 201.8052 18.5326 37.1985 10.9578 4.1375 24.5626 9.8541 22.8171 13.2792 6.7359 2.7020 0.1406 13.7762 30.2451 22.6495 13.1825 25.0002
temp: 298.150 k
press: 1.00000 atm
elementType: 8 8 8 8 7 7 6 6 6 6 6 6 6 6 6 1 1 1 1 1 1 1 1 1 1 1 1 1 1 1 1
symmnumber: 1
zpe: 653931.7 jmol-1
zpe.correction: 0.249069 hartree
zpe.thermalcorrener: 0.266904 hartree
zpe.thermalcorrenthalpy: 0.267848 hartree
zpe.thermalcorrgfe: 0.198271 hartree
zpe.sumelectzpe: -761.707100 hartree
zpe.sumelectthermal: -761.689266 hartree
zpe.sumelectthermalent: -761.688322 hartree
zpe.sumelectthermalfe: -761.757899 hartree
dipole: 1.5553 -1.2869 4.6725
dipole: 5.0900
quadrupole: -69.4491 -110.1737 -90.6202
quadrupole: 3.5184 -9.5601 2.4465
quadrupole: 20.6319 -20.0927 -0.5392 3.5184 -9.5601 2.4465
hfenergy: -761.9561698 hartree
pointgroup: C01 [X(C9H16N2O4)]
dipole: 0.6308321 -0.8852875 1.6818179 debye
polarizability: 149.0440976|-3.7043047|129.0737131|-4.1958284|3.0430866|97.3853829 unknown
InChI: InChI=1S/C9H16N2O4/c1-8(12)4-2-6-11(10-15)7-3-5-9(13)14/h13H,2-7H2,1H3
charge 0 multiplicity 1
31 atoms
O  -3.173634 -1.775655 -1.401511
O  5.114145 -1.651206 -0.615829
O  -1.387968 3.342223 0.065289
O  2.991114 -2.557204 -0.365329
N  0.095188 1.781038 0.712503
N  -0.141684 3.016186 0.128041
C  -1.008509 0.949581 1.243042
C  1.513368 1.405487 0.832181
C  -1.736916 0.130871 0.15054
C  1.877927 0.109774 0.073783
C  -2.946232 -0.617722 0.739621
C  3.389936 -0.173796 0.18501
C  -3.670192 -1.510919 -0.275618
C  3.753694 -1.570087 -0.286253
C  -5.030619 -2.053715 0.149211
H  -1.730215 1.642058 1.719385
H  -0.584879 0.285613 2.019236
H  1.771797 1.288256 1.905556
H  2.084855 2.264975 0.437644
H  -1.048946 -0.592456 -0.320754
H  -2.079524 0.81349 -0.646543
H  1.587946 0.206522 -0.988461
H  1.321617 -0.753966 0.481304
H  -2.631675 -1.272425 1.582332
H  -3.681477 0.090075 1.175111
H  3.72015 -0.096103 1.242298
H  3.992035 0.56068 -0.378546
H  -5.794655 -1.262177 0.01736
H  -5.040776 -2.340763 1.216257
H  -5.312598 -2.913957 -0.477821
H  5.331027 -2.583476 -0.891839
