program: Gaussian 09
title: 000187077
version: EM64L-G09RevD.01
frameworkgroup: C1[X(C19H25NO)]
method: RPBEPBE
basis: SDD
operation: Freq
keyword: #p
keyword: freq=noraman
keyword: PBEPBE/SDD
title: #p freq=noraman PBEPBE/SDD
converged: NO YES NO NO
title: Mulliken charges:
elementType: O N C C C C C C C C C C C C C C C C C C C H H H H H H H H H H H H H H H H H H H H H H H H H
charge: -0.436300 -0.043635 0.184937 -0.231573 -0.090777 -0.182704 -0.457583 0.335774 -0.412515 0.272967 -0.602143 -0.797839 -0.808432 -0.490301 0.524134 -0.595886 -0.390287 -0.400952 0.269342 -0.418136 -0.861812 0.211703 0.220955 0.235963 0.193103 0.211697 0.207384 0.221389 0.205781 0.203484 0.203685 0.221772 0.235314 0.234378 0.226393 0.212148 0.214594 0.208348 0.222440 0.230249 0.220492 0.250669 0.239975 0.227928 0.223565 0.350312
chargesum: 0.00000
title: Mulliken charges with hydrogens summed into heavy atoms:
elementType: O N C C C C C C C C C C C C C C C C C C C
charge: -0.085987 -0.043635 0.184937 -0.019870 0.130178 0.053259 -0.052784 0.335774 0.016259 0.272967 -0.192878 -0.137068 -0.135513 -0.067358 0.524134 -0.373445 -0.160038 -0.180461 0.269342 -0.167467 -0.170344
polarizability: 2.22185996e+02 -5.42402255e+00 2.18879685e+02 9.32947435e+00 8.09516051e+00 1.66799233e+02
1716.lowfreq: -18.8483 -8.4288 -0.0009 -0.0005 0.0005 10.7910 52.9384 61.5463 115.3590
frequency: 52.9133 61.5273 115.3498 117.4837 163.8217 179.6816 200.3757 208.0248 228.1053 243.6992 257.9865 268.6040 272.1406 281.5557 290.4809 313.0812 314.9460 339.6625 343.4412 352.2915 373.3329 393.4074 411.5651 439.5438 462.9817 465.6422 491.4024 495.6673 511.7090 527.1976 553.1024 624.9666 652.3516 678.8519 685.0159 689.1358 703.5165 742.9430 766.2011 800.1916 813.4005 829.8688 836.3026 854.1288 859.4323 884.8448 898.0250 920.6486 938.0108 955.6540 959.6330 970.0007 992.0534 1011.6470 1022.1888 1034.0750 1037.1495 1048.4193 1068.8778 1073.8008 1085.0915 1109.1676 1118.3753 1127.2802 1136.2191 1153.5705 1156.6934 1161.1694 1185.7604 1190.5734 1206.8913 1213.6242 1232.6915 1243.1240 1252.0584 1257.4112 1269.0086 1292.1690 1306.6735 1313.1830 1319.5690 1325.0959 1332.4040 1333.8917 1348.4888 1367.1330 1369.7810 1375.1091 1384.2284 1385.7628 1390.8275 1393.0345 1421.2075 1445.6646 1449.7218 1461.8386 1466.8903 1469.8567 1479.1352 1481.5348 1485.1209 1490.8801 1494.0860 1497.4777 1598.7629 1616.0057 1678.7132 2909.8780 2912.8332 2949.1452 2955.6036 2957.5890 2959.5095 2972.3273 2972.9374 2976.0476 2982.8386 2996.6435 3014.8250 3023.3958 3031.5150 3038.8934 3060.2324 3061.0598 3074.3193 3076.4295 3083.3251 3091.3595 3115.9136 3137.2542 3170.0012 3579.0744
redmass: 4.5163 3.5319 3.9275 3.4044 2.7266 1.9662 2.5027 1.3752 3.2591 1.5035 2.1000 1.9135 2.6649 2.2309 1.7139 2.2253 3.5196 2.7835 1.1419 3.0417 3.7356 2.7640 3.4069 3.0597 3.8269 2.9678 3.5527 3.2855 3.0787 3.6885 2.9853 3.8006 4.0680 3.8541 4.8486 3.5718 3.4934 3.3006 2.5747 2.0608 1.7149 1.7341 1.9003 1.7050 1.9595 2.6005 2.0684 2.7762 2.0293 1.6576 1.4929 1.9232 1.8033 1.5099 1.6594 2.4085 2.2548 1.9508 2.1552 2.1686 2.4674 2.3196 2.1214 2.0223 1.6994 1.7383 1.7423 2.1409 1.8328 1.8044 2.5722 1.3186 1.2706 1.6152 1.6245 1.6864 1.7191 1.3810 1.7344 1.4660 1.4334 1.4708 1.4663 1.3777 1.5567 2.2439 1.5168 2.0965 1.4214 1.2320 1.2328 1.2114 2.9774 1.0859 1.1079 1.0502 1.0570 1.0710 1.1375 1.1228 1.1084 1.4366 1.2470 1.1620 6.3803 6.4763 6.6205 1.0790 1.0672 1.0684 1.0669 1.0610 1.0524 1.0409 1.0519 1.0449 1.0828 1.0872 1.0999 1.0928 1.0964 1.1028 1.0985 1.0988 1.0987 1.0983 1.0992 1.0917 1.0891 1.0874 1.0958 1.0659
irintensity: 0.0118 0.6839 1.2118 0.1923 0.0802 1.6057 0.7578 0.0102 0.1328 0.9056 0.9750 2.9365 1.0167 0.3772 0.6439 0.7035 0.9114 2.7398 129.4301 3.0767 2.4280 8.4631 0.0636 6.2533 7.9272 5.0772 7.2323 0.0112 9.5403 3.4608 3.9185 4.2080 1.8931 7.7689 2.1263 2.7463 8.6277 3.4616 3.0353 2.6531 12.1229 30.1560 7.2233 24.9637 19.3959 10.6471 6.6988 14.4671 3.6485 7.3223 0.9114 3.7929 4.2444 8.2212 6.9694 6.2836 3.5537 3.4504 5.5915 4.0162 6.4804 43.9053 11.8879 36.8333 158.6814 18.6102 50.9024 1.2934 2.7019 6.6593 13.5241 3.5823 12.0597 4.9551 4.4759 6.7289 0.3678 4.8857 3.6295 4.1251 3.4115 3.4783 5.4349 2.3804 8.7741 7.8062 3.9618 12.0934 7.0343 11.9065 14.7737 21.4731 45.7902 17.1815 11.3935 11.0536 8.6167 15.6200 12.0424 21.9421 23.1477 14.0328 18.4324 18.3495 6.5113 69.7823 9.6392 17.9307 53.1741 28.2025 48.8281 61.1710 60.6963 16.5859 24.0007 45.0483 39.4948 72.9449 38.1748 26.2824 24.4381 33.4413 60.0159 12.3717 51.4598 20.4743 26.1380 52.4941 21.3545 13.7182 10.8290 32.4263
temp: 298.150 k
press: 1.00000 atm
elementType: 8 7 6 6 6 6 6 6 6 6 6 6 6 6 6 6 6 6 6 6 6 1 1 1 1 1 1 1 1 1 1 1 1 1 1 1 1 1 1 1 1 1 1 1 1 1
symmnumber: 1
zpe: 1041097.8 jmol-1
zpe.correction: 0.396533 hartree
zpe.thermalcorrener: 0.415189 hartree
zpe.thermalcorrenthalpy: 0.416133 hartree
zpe.thermalcorrgfe: 0.352662 hartree
zpe.sumelectzpe: -867.396071 hartree
zpe.sumelectthermal: -867.377416 hartree
zpe.sumelectthermalent: -867.376472 hartree
zpe.sumelectthermalfe: -867.439942 hartree
dipole: -0.0707 -1.1684 -0.0262
dipole: 1.1709
quadrupole: -122.3249 -129.7968 -123.4805
quadrupole: 8.9971 6.0013 1.3647
quadrupole: 2.8759 -4.5961 1.7202 8.9971 6.0013 1.3647
hfenergy: -867.7926046 hartree
pointgroup: C01 [X(C19H25N1O1)]
dipole: -0.012233 0.4604906 -0.0021725 debye
polarizability: 222.9191416|-4.9857081|218.2595466|-9.2466572|-7.9281714|166.686226 unknown
InChI: InChI=1S/C19H25NO/c1-12-6-8-20-9-7-19(3)13(2)18(20)16(10-12)15-5-4-14(21)11-17(15)19/h4-6,11,13,16,18,21H,7-10H2,1-3H3
charge 0 multiplicity 1
46 atoms
O  4.242439 -1.946884 -0.785348
N  -1.919578 1.299278 -0.646194
C  0.93987 1.811787 -0.242968
C  -1.328569 1.254793 0.717663
C  -0.147104 2.257029 0.790104
C  -0.85787 -0.134118 1.265203
C  0.27346 1.904266 -1.658279
C  1.352652 0.344334 0.009819
C  -0.987231 1.032307 -1.767221
C  0.471058 -0.587232 0.644316
C  -2.00244 -1.195617 1.304771
C  2.141184 2.790829 -0.207708
C  0.392384 2.440722 2.226264
C  -3.214873 0.587012 -0.797327
C  -2.5416 -1.746644 -0.017418
C  2.605889 -0.114791 -0.469604
C  0.904674 -1.931381 0.791713
C  -3.124433 -0.932848 -0.942396
C  3.002804 -1.460783 -0.321346
C  2.149536 -2.383564 0.318061
C  -2.448467 -3.247048 -0.22381
H  -2.127987 1.609466 1.403022
H  -0.544699 3.231422 0.439401
H  -0.641266 0.056131 2.342043
H  0.999737 1.591421 -2.433885
H  0.010963 2.964196 -1.845972
H  -1.522003 1.270083 -2.708866
H  -0.69482 -0.04075 -1.82673
H  -2.842665 -0.71263 1.850243
H  -1.685052 -2.039656 1.94599
H  2.79792 2.665795 -1.088428
H  1.770773 3.833064 -0.227243
H  2.756249 2.659374 0.699569
H  0.99487 1.576535 2.561162
H  1.032748 3.337577 2.296234
H  -0.441867 2.57505 2.941206
H  -3.728769 1.003567 -1.685496
H  -3.836441 0.849267 0.084878
H  3.286679 0.589781 -0.96405
H  0.254493 -2.651988 1.298658
H  -3.52515 -1.377712 -1.864826
H  2.469922 -3.422738 0.435177
H  -1.392251 -3.579529 -0.251444
H  -2.928744 -3.56071 -1.167206
H  -2.934713 -3.795824 0.607583
H  4.762687 -1.221439 -1.211814
