program: Gaussian 09
title: 000187074
version: EM64L-G09RevD.01
frameworkgroup: C1[X(C20H25NO)]
method: RPBEPBE
basis: SDD
operation: Freq
keyword: #p
keyword: freq=noraman
keyword: PBEPBE/SDD
title: #p freq=noraman PBEPBE/SDD
converged: YES YES NO NO
title: Mulliken charges:
elementType: O N C C C C C C C C C C C C C C C C C C C C H H H H H H H H H H H H H H H H H H H H H H H H H
charge: -0.443565 -0.173977 0.150737 -0.511768 -0.408246 -0.436622 -0.401910 0.358755 0.409225 -0.362445 -0.436318 -0.332789 -0.397530 -0.413533 -0.404596 -0.299368 -0.251995 -0.245290 -0.248340 -0.257893 -0.246107 -0.248100 0.212339 0.200586 0.202472 0.216639 0.241001 0.207019 0.201525 0.198923 0.188118 0.241040 0.216595 0.187008 0.247523 0.219430 0.249044 0.276708 0.230638 0.186672 0.228767 0.221287 0.222274 0.226074 0.227042 0.226894 0.326061
chargesum: 0.00000
title: Mulliken charges with hydrogens summed into heavy atoms:
elementType: O N C C C C C C C C C C C C C C C C C C C C
charge: -0.117505 -0.173977 0.150737 -0.098842 0.010865 0.011398 -0.001463 0.358755 0.409225 0.066713 -0.032716 -0.085266 -0.178099 -0.164489 -0.127888 0.117941 -0.023228 -0.024004 -0.026066 -0.031819 -0.019066 -0.021206
polarizability: 2.20364184e+02 7.67787074e+00 2.15690491e+02 -2.77209581e+00 -1.06535671e+01 2.10338281e+02
1716.lowfreq: -15.8264 -5.9289 -3.8280 -0.0007 -0.0005 -0.0005 14.7602 38.8460 47.6406
frequency: -8.5601 38.8341 47.5722 59.3825 76.9807 81.1083 94.7488 107.1036 152.7700 163.0631 210.1674 221.8284 264.3871 267.0225 282.2411 289.5892 306.0016 324.6023 338.9392 340.4766 401.5010 403.3246 412.6947 453.5615 457.7342 481.7129 499.3667 539.9913 552.6320 607.7731 616.8354 617.9361 637.0228 673.7481 702.5322 712.6752 744.6916 757.8560 785.4199 803.4037 812.4382 839.2505 851.8153 855.4791 863.6748 867.4335 915.9307 920.9078 935.3775 939.8951 958.1147 973.7070 977.2408 986.0320 990.5923 991.4676 994.9375 1000.6844 1019.1326 1021.7057 1027.9925 1030.5949 1035.8592 1057.9778 1075.8970 1082.0395 1086.1565 1101.0583 1108.1563 1121.7481 1154.2121 1170.0629 1171.5568 1173.0612 1186.2280 1194.5779 1197.4254 1199.5727 1210.0414 1251.5081 1263.0266 1278.1742 1302.3386 1309.0908 1315.7609 1319.5056 1333.5936 1336.9920 1339.9756 1350.4345 1353.7956 1363.8484 1374.6093 1377.5091 1381.5094 1430.8298 1435.0784 1459.6453 1460.6829 1467.2754 1471.9496 1475.2360 1480.3190 1482.0941 1485.3741 1486.9216 1586.7181 1589.1762 1606.7092 1610.0958 2886.4388 2953.2521 2968.3958 2976.9960 2980.1893 2982.0048 3003.1100 3027.1365 3031.8249 3036.7995 3045.7960 3057.1509 3065.0981 3097.3814 3119.2435 3121.6636 3126.0082 3131.7352 3140.4341 3146.5013 3149.9585 3159.8528 3161.5900 3168.0083 3555.6093
redmass: 4.1256 5.1007 4.0976 3.9716 3.8938 2.3100 4.0901 3.4556 3.2050 3.9167 3.0351 3.2093 4.1774 2.9484 4.2354 3.0855 2.2124 1.6779 2.2793 2.4185 2.2048 2.8005 2.7370 3.8544 2.5881 3.3914 3.1613 3.2134 2.2237 3.1279 6.2923 6.3199 4.4601 4.3284 1.7962 1.7578 2.2097 1.8348 1.6075 1.7938 1.8975 2.3146 1.2822 1.8088 1.3915 1.8926 1.4327 2.3830 1.7924 1.6866 1.9534 3.6897 1.4485 1.3861 5.9982 4.3668 1.3985 2.6921 1.4135 2.5511 2.0948 2.2418 2.0855 2.1027 2.0309 1.6716 1.7599 1.8442 1.7979 2.0729 1.5585 1.0669 1.3794 1.3613 1.2942 1.5403 2.0860 1.5539 1.6841 1.3642 1.3357 1.1359 1.3234 1.3720 1.3220 1.3427 1.3805 1.3538 1.3257 1.3536 1.2575 1.3051 6.8006 3.4474 1.6661 2.2041 2.2580 1.0918 1.0863 1.1126 1.4207 1.2613 1.7274 1.1082 1.2152 1.1968 6.0237 6.0476 6.0854 6.0363 1.0711 1.0706 1.0638 1.0588 1.0608 1.0655 1.0633 1.0946 1.0965 1.0981 1.1019 1.0889 1.1021 1.0949 1.0842 1.0845 1.0872 1.0889 1.0914 1.0952 1.0931 1.0936 1.1012 1.0990 1.0661
irintensity: 1.7882 0.7746 0.7115 0.6604 0.0339 2.7428 1.5571 0.5023 0.8163 0.7806 1.1634 0.9062 0.2072 9.8526 0.3311 7.0661 4.4756 65.4660 36.8130 20.5466 0.6157 0.2136 0.7481 0.3644 6.7877 6.5243 3.8951 7.6802 1.6987 17.7759 0.1934 0.5763 11.4198 3.4636 42.7840 64.3523 22.4317 32.5875 33.4879 2.5562 6.6815 0.9937 1.4433 15.9420 4.3550 6.5815 10.5099 6.5213 1.1308 4.0545 8.2145 127.0213 7.9693 0.3588 0.5335 0.3863 1.1599 26.9903 5.4017 27.3720 11.1518 2.5466 9.7808 11.6205 6.3373 3.9390 3.4938 3.5351 36.1628 7.4286 3.9493 0.8882 4.2716 3.9536 15.4027 1.2411 24.5910 7.4314 2.7637 12.0314 11.3508 3.4654 1.1627 3.1037 5.7456 4.0209 2.7765 1.9207 4.7973 2.9560 12.2380 9.2188 0.6549 0.2478 3.2896 0.7026 18.0192 9.1655 2.5468 14.4797 33.2050 3.3407 3.7810 21.0370 3.0277 12.0252 0.0990 1.9295 11.5701 2.6911 67.0873 65.2357 52.1626 35.8582 48.2003 28.7885 23.3547 11.7166 55.7356 47.9777 60.6172 34.2944 50.9465 30.3201 2.0277 0.7090 2.9955 11.1371 16.8310 31.3582 33.3156 27.6436 28.7952 9.5512 5.1493
temp: 298.150 k
press: 1.00000 atm
elementType: 8 7 6 6 6 6 6 6 6 6 6 6 6 6 6 6 6 6 6 6 6 6 1 1 1 1 1 1 1 1 1 1 1 1 1 1 1 1 1 1 1 1 1 1 1 1 1
symmnumber: 1
zpe: 1055711.8 jmol-1
zpe.correction: 0.402099 hartree
zpe.thermalcorrener: 0.421361 hartree
zpe.thermalcorrenthalpy: 0.422305 hartree
zpe.thermalcorrgfe: 0.354977 hartree
zpe.sumelectzpe: -905.439191 hartree
zpe.sumelectthermal: -905.419929 hartree
zpe.sumelectthermalent: -905.418985 hartree
zpe.sumelectthermalfe: -905.486314 hartree
dipole: -0.1052 0.6662 -2.8317
dipole: 2.9109
quadrupole: -126.1495 -129.7022 -131.2856
quadrupole: 4.4000 -6.9142 2.0301
quadrupole: 2.8963 -0.6564 -2.2398 4.4000 -6.9142 2.0301
hfenergy: -905.8412903 hartree
pointgroup: C01[X(C20H25N1O1)]
dipole: -0.0381083 -0.3617484 -1.0859236 debye
polarizability: 218.2571657|9.1166119|219.8516734|-0.5113592|9.0898057|208.2841167 unknown
InChI: InChI=1S/C20H25NO/c22-17-9-16-21-15-8-7-14-20(21,18-10-3-1-4-11-18)19-12-5-2-6-13-19/h1-6,10-13,22H,7-9,14-17H2
charge 0 multiplicity 1
47 atoms
O  -4.412793 0.796947 2.518862
N  -1.028748 0.924865 -0.313357
C  0.209002 0.161903 -0.755015
C  0.447776 0.400019 -2.284242
C  0.554173 1.902298 -2.635924
C  -0.9389 2.379289 -0.6522
C  -0.702643 2.663784 -2.157946
C  0.037731 -1.347613 -0.422885
C  1.430354 0.636887 0.09198
C  -2.331182 0.329483 -0.728032
C  -3.503659 0.757725 0.187608
C  -0.253507 -1.734166 0.913281
C  2.756931 0.389205 -0.345201
C  0.198131 -2.368808 -1.391588
C  1.249353 1.231972 1.366581
C  -3.315269 0.328953 1.652964
C  -0.389709 -3.091408 1.267234
C  3.866234 0.739181 0.456242
C  0.069948 -3.733761 -1.039155
C  2.354539 1.585602 2.170572
C  -0.225897 -4.103047 0.290417
C  3.672031 1.342806 1.719562
H  -0.407761 -0.037673 -2.83704
H  1.35234 -0.128431 -2.636685
H  0.688667 2.019055 -3.728373
H  1.453063 2.33411 -2.152711
H  -0.105493 2.822372 -0.077478
H  -1.864315 2.869565 -0.301992
H  -0.583451 3.753732 -2.312144
H  -1.582409 2.348716 -2.75416
H  -2.600979 0.581364 -1.78134
H  -2.235607 -0.769027 -0.685587
H  -3.658211 1.85326 0.159275
H  -4.431141 0.299058 -0.217625
H  -0.3723 -0.958951 1.676557
H  2.937041 -0.096367 -1.310486
H  0.422181 -2.116431 -2.432167
H  0.226678 1.413633 1.714727
H  -2.411157 0.795522 2.073241
H  -3.203124 -0.775092 1.719515
H  -0.614539 -3.361761 2.305367
H  4.881252 0.535295 0.095971
H  0.201371 -4.505554 -1.806462
H  2.185877 2.047609 3.150256
H  -0.324009 -5.159684 0.563766
H  4.531908 1.614812 2.34205
H  -5.265677 0.422848 2.180762
