program: Gaussian 09
title: 000187044
version: EM64L-G09RevD.01
frameworkgroup: C1[X(C17H10O)]
method: RPBEPBE
basis: SDD
operation: Freq
keyword: #pfreq=noraman
keyword: PBEPBE/SDD
title: #p freq=noraman PBEPBE/SDD
converged: NO YES NO NO
title: Mulliken charges:
elementType: O C C C C C C C C C C C C C C C C C H H H H H H H H H H
charge: -0.221755 0.281533 0.517375 0.292884 0.357293 0.343505 -0.558645 0.203003 -0.633710 -0.665869 -0.077185 -0.452649 -0.379303 -0.416256 -0.379870 -0.245969 -0.248176 -0.244618 0.245720 0.267857 0.268949 0.223473 0.260689 0.262478 0.287195 0.245784 0.229771 0.236496
chargesum: 0.00000
title: Mulliken charges with hydrogens summed into heavy atoms:
elementType: O C C C C C C C C C C C C C C C C C
charge: -0.221755 0.281533 0.517375 0.292884 0.357293 0.343505 -0.312925 0.203003 -0.365852 -0.396919 -0.077185 -0.191960 -0.155830 -0.153778 -0.092675 -0.000184 -0.018406 -0.008122
polarizability: 4.11714097e+02 3.63005558e+01 2.15775863e+02 -1.27486942e-03 1.95318182e-03 6.80443514e+01
1716.lowfreq: -0.0004 0.0003 0.0006 8.2814 12.7473 16.4102 60.2536 75.4741 126.9856
frequency: 60.2394 75.4662 126.9787 177.6872 181.4969 205.2781 293.1899 309.3375 327.9353 333.1113 346.2563 417.8981 432.7498 466.4605 481.9855 518.9668 558.0400 577.5990 591.4407 664.6983 666.7977 685.5000 714.4179 742.4579 748.7123 763.9454 776.4625 783.9428 803.6736 827.1616 847.4516 852.4102 887.3833 907.7759 924.1109 931.2425 957.4186 958.7776 978.6857 1006.0276 1009.0893 1038.5245 1071.3858 1079.2156 1117.6501 1144.2411 1174.6580 1191.5980 1215.4810 1238.9016 1265.0758 1284.7454 1291.5999 1310.9192 1336.7068 1385.3800 1397.2607 1406.2371 1443.6474 1461.4998 1477.4319 1502.9085 1520.7136 1552.8845 1574.8460 1593.2163 1614.6173 1643.6163 3128.2350 3129.3595 3137.5163 3141.1315 3146.5688 3156.0017 3167.8360 3173.7295 3186.0844 3210.2020
redmass: 5.1458 4.6944 4.8176 5.0693 5.1324 4.5455 7.1225 4.0386 6.9033 4.0205 6.9050 2.7179 3.3593 5.3651 7.3285 3.2572 2.7628 6.4686 7.4141 2.9356 6.3124 3.1953 5.5143 6.1919 1.9926 6.1419 1.8087 1.5424 2.0615 5.2532 1.4830 3.4176 1.4299 1.7787 1.4231 1.5899 4.0669 1.8841 1.3972 1.3588 1.7829 2.3849 1.9249 1.7472 2.1298 1.9756 1.1497 1.6638 1.7714 1.5526 2.5825 2.6608 1.4397 2.6561 2.3148 8.2790 2.5788 4.6098 3.1748 3.6025 4.3003 5.1709 5.9868 6.2075 6.9237 7.1822 6.4081 8.2859 1.0925 1.0860 1.0916 1.0906 1.0896 1.0935 1.1004 1.0910 1.0932 1.1071
irintensity: 1.3619 1.2088 0.5644 0.6027 4.8193 0.9346 2.6249 0.0279 11.6323 1.7175 1.8329 17.1113 0.0557 12.6980 4.7588 0.0499 8.3167 1.4771 2.4797 4.7191 2.6092 2.3046 6.3187 0.6143 77.5395 0.9364 10.1262 71.4306 0.4200 27.2375 5.4121 0.5841 1.2709 0.9015 17.8275 11.1430 8.0302 33.3024 0.6953 0.2088 20.4550 19.2365 2.6816 7.8441 56.0562 0.6391 0.2466 4.4140 25.6770 18.7397 1.4538 5.9737 1.8198 151.8851 10.4102 49.9694 12.8162 29.8295 10.4769 47.5353 20.0058 149.2782 40.6132 4.9398 185.5685 29.4706 21.3589 31.4414 7.6362 1.9289 7.4064 8.7385 1.7530 12.4289 37.2818 7.1166 7.2326 20.7737
temp: 298.150 k
press: 1.00000 atm
elementType: 8 6 6 6 6 6 6 6 6 6 6 6 6 6 6 6 6 6 1 1 1 1 1 1 1 1 1 1
symmnumber: 1
zpe: 555258.0 jmol-1
zpe.correction: 0.211487 hartree
zpe.thermalcorrener: 0.224032 hartree
zpe.thermalcorrenthalpy: 0.224976 hartree
zpe.thermalcorrgfe: 0.172575 hartree
zpe.sumelectzpe: -727.831126 hartree
zpe.sumelectthermal: -727.818581 hartree
zpe.sumelectthermalent: -727.817636 hartree
zpe.sumelectthermalfe: -727.870038 hartree
dipole: -3.7559 -3.1675 0.0000
dipole: 4.9133
quadrupole: -93.3538 -96.4784 -109.5100
quadrupole: -13.3516 -0.0004 0.0002
quadrupole: 6.4270 3.3023 -9.7293 -13.3516 -0.0004 0.0002
hfenergy: -728.0426128 hartree
pointgroup: C01 [X(C17H10O1)]
dipole: -1.4493705 1.2790266 0.0000146 debye
polarizability: 409.988149|-40.6562507|217.5018112|0.0013183|0.0019241|68.0443514 unknown
InChI: InChI=1S/C17H10O/c18-17-10-13-8-11-4-3-5-12(11)9-16(13)14-6-1-2-7-15(14)17/h1-10H
charge 0 multiplicity 1
28 atoms
O  2.794193 -2.791115 -0.00006
C  -0.087455 0.302456 0.000022
C  -0.4680 -1.117248 -0.000033
C  1.351321 0.641762 0.000001
C  -2.48369 0.88314 -0.00001
C  -2.861828 -0.54065 -0.000063
C  -1.106806 1.264109 0.000036
C  2.338262 -0.399272 0.000014
C  -1.882142 -1.506719 -0.000069
C  0.500572 -2.117467 -0.000063
C  1.940049 -1.832782 0.000091
C  -3.675226 1.629335 0.000002
C  1.817772 1.989688 -0.000024
C  -4.333032 -0.608757 -0.000111
C  3.724008 -0.086538 -0.000008
C  -4.809985 0.69897 -0.00006
C  3.191251 2.289341 -0.000041
C  4.157409 1.248164 -0.000036
H  -0.863442 2.331634 0.000093
H  -2.122264 -2.577154 -0.000093
H  0.215019 -3.176712 -0.000143
H  1.10496 2.819883 -0.000046
H  -3.758737 2.719192 0.000042
H  -4.925452 -1.525326 -0.000167
H  4.431257 -0.922464 0.000008
H  -5.858765 1.003007 -0.000075
H  3.515897 3.335981 -0.000063
H  5.226153 1.48654 -0.000042
