program: Gaussian 09
title: 000186998
version: EM64L-G09RevD.01
frameworkgroup: C1[X(C18H14O3)]
method: RPBEPBE
basis: SDD
operation: Freq
keyword: #pfreq=noraman
keyword: PBEPBE/SDD
title: #p freq=noraman PBEPBE/SDD
converged: YES YES NO NO
title: Mulliken charges:
elementType: O O O C C C C C C C C C C C C C C C C C C H H H H H H H H H H H H H H
charge: -0.447855 -0.466477 -0.431498 -0.201741 0.210122 0.190022 -0.305032 0.229254 0.480074 -0.512371 0.282013 -0.391857 -0.624004 -0.496567 0.413732 -0.712700 0.399753 -0.434617 -0.422652 -0.246948 -0.243788 0.255720 0.246329 0.215423 0.276429 0.221708 0.242572 0.247382 0.368239 0.366095 0.238163 0.241248 0.358751 0.227227 0.227854
chargesum: 0.00000
title: Mulliken charges with hydrogens summed into heavy atoms:
elementType: O O O C C C C C C C C C C C C C C C C C C
charge: -0.079615 -0.100382 -0.072747 0.053979 0.210122 0.190022 -0.058703 0.229254 0.480074 -0.296949 0.282013 -0.115428 -0.402296 -0.253996 0.413732 -0.465318 0.399753 -0.196454 -0.181404 -0.019722 -0.015935
polarizability: 3.81679629e+02 -5.42128641e+00 2.31659895e+02 -7.15906939e+00 -2.53025869e+00 9.43038830e+01
1716.lowfreq: -8.8726 -2.2311 0.0004 0.0004 0.0008 3.2553 43.0363 55.9198 81.8104
frequency: 43.0306 55.9043 81.8099 120.2012 126.3050 147.2498 215.6855 233.5553 250.7021 259.9893 267.2500 270.3138 294.6863 326.7619 342.5158 399.9210 409.9706 415.2301 444.3351 466.3995 469.3294 495.2127 502.3856 514.6065 542.1396 562.0855 585.4214 617.6930 622.7166 635.3752 670.3918 710.9935 732.2146 753.3376 759.8246 777.8457 796.6559 817.7624 826.8815 853.3612 858.9048 866.7938 895.4668 906.1220 930.3564 935.2496 941.9826 965.9993 987.5290 989.5471 995.3246 1013.5175 1037.1298 1068.3056 1109.7001 1134.0951 1158.4243 1171.2119 1189.3654 1196.2699 1207.6567 1221.4640 1230.6986 1242.2373 1276.5196 1282.8671 1296.1191 1313.0417 1317.2534 1351.9475 1355.2187 1376.4126 1401.1370 1413.5169 1419.0220 1429.5195 1443.7469 1453.9792 1484.8542 1545.0897 1559.6917 1582.1389 1618.5436 1636.4822 1650.3554 2988.7642 3017.0794 3116.6075 3117.3958 3122.6210 3123.4315 3128.5019 3137.0945 3141.6164 3160.9129 3161.5203 3487.2400 3559.7890 3594.9129
redmass: 5.5437 4.6936 5.4030 4.9582 5.5265 5.6338 4.2957 3.9126 4.8338 2.6522 3.4922 1.8439 4.5238 4.0561 4.6588 5.8542 4.9346 3.6477 1.1942 3.5139 2.7856 1.8919 2.8934 2.9315 5.0370 3.3924 5.2252 4.6925 5.3256 5.4589 5.7166 4.9039 3.1496 1.4409 4.6326 2.7295 2.2886 4.5179 1.4189 1.5496 1.9496 3.4430 1.7465 4.3747 4.0780 2.2073 4.6045 1.4029 1.3442 1.3954 2.8452 2.2959 3.1345 2.6688 1.7426 1.6581 1.2554 1.0861 1.4726 1.4401 1.2864 1.5818 1.5794 1.5486 1.7238 1.9083 1.6694 1.9411 2.5030 1.5344 2.2300 1.2185 4.2836 2.9066 2.4931 4.4682 4.7178 2.8448 3.0815 6.4638 6.9645 5.7431 6.7701 6.6216 7.9072 1.0829 1.0858 1.0890 1.0884 1.0901 1.0888 1.0884 1.0884 1.0949 1.0999 1.0959 1.0647 1.0656 1.0668
irintensity: 0.1628 1.1696 0.3433 1.4941 1.2360 0.3368 5.5666 6.4381 0.3021 68.0999 23.6185 67.1084 0.6599 9.1354 8.1458 13.5928 0.0604 0.6620 136.3795 11.7930 12.0157 46.0027 24.2365 40.9643 13.6968 1.5520 3.1707 16.0259 5.3274 7.1510 48.7564 58.5476 51.7526 41.9842 6.4400 3.3017 2.3914 11.7319 1.5773 29.9617 1.9489 7.3787 49.8842 17.0661 16.8570 22.2747 56.7397 12.5302 0.3314 1.0032 47.4093 6.4561 97.4592 51.3950 293.2377 2.5403 18.2186 1.5593 3.6520 1.4073 18.7839 2.0274 28.1685 19.2804 9.5886 3.6300 8.2873 53.7610 2.0020 7.3002 6.9069 64.7974 5.9662 12.8678 5.8076 1.7233 6.2015 9.4600 0.1993 14.1216 6.4675 1.6327 22.7573 3.2477 127.6090 8.6842 51.9905 1.2586 10.2177 4.2143 7.7111 10.6319 16.7602 40.7709 46.7181 12.2749 38.3684 48.1888 30.1779
temp: 298.150 k
press: 1.00000 atm
elementType: 8 8 8 6 6 6 6 6 6 6 6 6 6 6 6 6 6 6 6 6 6 1 1 1 1 1 1 1 1 1 1 1 1 1 1
symmnumber: 1
zpe: 710201.1 jmol-1
zpe.correction: 0.270501 hartree
zpe.thermalcorrener: 0.287079 hartree
zpe.thermalcorrenthalpy: 0.288023 hartree
zpe.thermalcorrgfe: 0.227057 hartree
zpe.sumelectzpe: -918.531985 hartree
zpe.sumelectthermal: -918.515408 hartree
zpe.sumelectthermalent: -918.514464 hartree
zpe.sumelectthermalfe: -918.575430 hartree
dipole: -0.7377 3.4300 0.2962
dipole: 3.5209
quadrupole: -114.3160 -104.1995 -126.0383
quadrupole: 10.8115 2.8349 -1.1443
quadrupole: 0.5353 10.6518 -11.1870 10.8115 2.8349 -1.1443
hfenergy: -918.8024866 hartree
pointgroup: C01 [X(C18H14O3)]
dipole: 0.2378605 -1.3613393 0.0949253 debye
polarizability: 380.4432799|-11.2039697|232.104984|15.204372|4.8298695|95.0951431 unknown
InChI: InChI=1S/C18H14O3/c19-16-9-15-13(17(20)18(16)21)6-5-12-7-10-3-1-2-4-11(10)8-14(12)15/h1-9,17-21H
charge 0 multiplicity 1
35 atoms
O  -4.248308 2.037724 -0.15453
O  -4.284171 -0.195226 1.311749
O  -3.759488 -2.78661 -0.390562
C  -3.441668 0.924443 -0.653397
C  -1.94838 1.081536 -0.35247
C  -1.115362 -0.053702 -0.332314
C  -4.033136 -0.405639 -0.140711
C  0.323458 0.110646 -0.16935
C  0.86243 1.463006 -0.023343
C  -1.728772 -1.38593 -0.4526
C  -3.082655 -1.552789 -0.367761
C  -1.405875 2.39547 -0.199933
C  1.233565 -0.975936 -0.142136
C  -0.03812 2.584584 -0.035266
C  2.630517 -0.790497 0.011264
C  2.258702 1.649029 0.13187
C  3.161619 0.560366 0.151304
C  3.550127 -1.90028 0.034496
C  4.583816 0.737045 0.306899
C  4.917582 -1.692887 0.186552
C  5.440784 -0.358655 0.324223
H  -3.572276 0.944792 -1.753899
H  -4.995562 -0.604148 -0.650827
H  -1.084648 -2.265413 -0.570682
H  -2.102076 3.239627 -0.213455
H  0.869348 -2.004743 -0.236269
H  0.374478 3.59294 0.085494
H  2.646551 2.66998 0.240127
H  -4.436245 1.827761 0.801048
H  -4.791416 -0.966998 1.665568
H  3.152195 -2.91707 -0.07032
H  4.979674 1.754382 0.411976
H  -3.125159 -3.544761 -0.4566
H  5.606777 -2.544385 0.202562
H  6.520297 -0.214261 0.442796
