program: Gaussian 09
title: 000015761
version: EM64L-G09RevD.01
frameworkgroup: C1[X(C9H9N)]
method: RPBEPBE
basis: SDD
operation: Freq
keyword: #p
keyword: freq=noraman
keyword: PBEPBE/SDD
title: #p freq=noraman PBEPBE/SDD
converged: YES YES NO NO
title: Mulliken charges:
elementType: N C C C C C C C C C H H H H H H H H H
charge: -0.012962 -0.251268 0.482171 -0.669738 -0.378935 -0.417409 -0.223373 -0.224486 -0.238594 -0.192191 0.250712 0.232570 0.236295 0.232811 0.250973 0.231727 0.230290 0.229349 0.232060
chargesum: 0.00000
title: Mulliken charges with hydrogens summed into heavy atoms:
elementType: N C C C C C C C C C
charge: -0.012962 -0.000557 0.482171 0.031937 -0.127962 -0.185681 0.006917 0.004863 -0.006534 -0.192191
polarizability: 1.23400732e+02 4.49686908e+00 9.73651488e+01 3.02623847e-01 -1.06553005e+01 5.91849431e+01
1716.lowfreq: -7.3217 -3.1094 -0.0006 -0.0005 0.0004 10.1583 24.4175 105.7004 146.6886
frequency: 24.1620 105.6994 146.6860 192.5454 230.0357 295.6120 329.8262 401.5654 418.0335 507.0858 564.9102 615.8816 619.3049 704.1820 751.7922 767.3448 853.4333 863.1034 920.9747 977.9046 987.4139 990.7358 998.2198 1027.0118 1053.7390 1082.6830 1096.2920 1174.7259 1192.9422 1198.8782 1253.2729 1292.0805 1337.4965 1384.2245 1387.8803 1442.6234 1468.6152 1474.7193 1485.8348 1596.2304 1614.1484 2192.6036 2993.8450 2995.5859 3100.8712 3106.1932 3115.2588 3126.4008 3137.2643 3148.9810 3166.0806
redmass: 3.9047 5.6349 4.2095 3.8033 1.0671 3.3475 4.6763 2.8143 7.4165 3.7939 3.9396 6.2279 5.2908 1.7773 3.6290 1.7629 1.2562 2.5248 1.3968 1.3919 2.1366 5.9788 1.3219 2.2234 2.2034 1.7319 1.6478 1.0541 1.1146 1.9135 1.5054 1.4806 1.2974 6.8592 1.1990 2.1804 1.0461 1.1465 1.9275 6.1412 6.0262 12.5693 1.0823 1.0341 1.1016 1.1015 1.0881 1.0864 1.0912 1.0960 1.1015
irintensity: 2.1103 2.6803 1.4071 1.6148 0.0401 0.6126 0.3008 0.1109 0.9252 5.5738 16.0817 0.4467 2.6754 53.4076 0.5572 49.8141 0.0336 0.2381 2.4515 0.0077 8.1203 0.6659 0.2692 7.1333 7.0678 15.3882 6.3719 0.0814 0.0957 2.6724 1.0449 4.6164 0.7702 0.3749 9.3601 11.8222 14.6173 1.1217 22.7509 0.9924 6.0976 9.6943 7.0713 20.3603 29.1871 16.4378 10.2184 0.9316 9.9909 31.9083 19.7308
temp: 298.150 k
press: 1.00000 atm
elementType: 7 6 6 6 6 6 6 6 6 6 1 1 1 1 1 1 1 1 1
symmnumber: 1
zpe: 400228.2 jmol-1
zpe.correction: 0.152439 hartree
zpe.thermalcorrener: 0.161603 hartree
zpe.thermalcorrenthalpy: 0.162547 hartree
zpe.thermalcorrgfe: 0.117251 hartree
zpe.sumelectzpe: -402.381589 hartree
zpe.sumelectthermal: -402.372426 hartree
zpe.sumelectthermalent: -402.371481 hartree
zpe.sumelectthermalfe: -402.416777 hartree
dipole: 2.6268 3.0031 0.8755
dipole: 4.0848
quadrupole: -63.5456 -57.4583 -60.6032
quadrupole: -9.4256 -2.9940 -5.0335
quadrupole: -3.0099 3.0774 -0.0675 -9.4256 -2.9940 -5.0335
hfenergy: -402.5340284 hartree
pointgroup: C01 [X(C9H9N1)]
dipole: -0.9931099 -0.1765879 -1.2510882 debye
dipolederiv: -0.2970373 -0.0270841 -0.0298419 -0.0051945 -0.2267184 0.0150457 -0.0920197 -0.0324944 -0.2492418 0.2167009 0.0375355 -0.0259782 0.1597879 0.2100143 -0.0475786 0.0262101 -0.0378588 0.0977705 0.3289822 -0.0672726 -0.0414908 -0.0806239 -0.0437209 -0.0306763 -0.1324155 -0.0155095 -0.0837196 -0.0713571 0.0237718 -0.0339568 -0.0100475 0.0602607 0.0368903 -0.0484306 -0.0183216 0.0383567 -0.1199261 -0.0194171 0.0730144 -0.0205671 -0.1124439 -0.0437123 0.09168 -0.0660408 -0.0264972 -0.145574 0.0249221 -0.0592953 -0.0007974 -0.1249174 -0.0883134 -0.0278855 -0.0844469 0.0347431 -0.0145062 0.016264 -0.0619379 0.0141382 -0.099051 -0.0954665 -0.0710629 -0.0956465 0.0771099 0.009306 -0.0509847 0.0584828 -0.0471542 -0.0874117 -0.0843906 0.0738254 -0.094092 0.0144573 0.0804954 -0.008718 -0.0329907 -0.0113239 -0.1483616 -0.0306224 -0.0407733 -0.0312367 -0.0933968 0.0103289 0.0407029 0.1307265 -0.0146631 -0.0839125 -0.0419223 0.189801 0.0189699 0.0904535 0.0217021 -0.0223191 -0.0242167 -0.0558631 -0.0301554 0.053699 -0.0011255 0.0593879 0.0073084 0.0475493 -0.0011281 -0.1201828 -0.0138776 0.0658622 -0.0024101 -0.1132561 -0.0265799 -0.0648109 0.0959747 -0.0525584 0.0399533 -0.0342493 -0.0391335 0.0414735 0.0346312 0.1093223 0.0181549 -0.1634179 0.0379722 0.0863929 0.0455057 0.0637228 -0.0238497 0.0820895 -0.0309944 0.0855311 0.037313 0.0478124 -0.0725298 0.0551465 0.1121012 0.0603719 -0.0776553 0.0618917 0.0354578 0.0479946 -0.0397982 0.0937027 -0.0333468 0.1123637 0.0779862 0.075104 0.0802393 -0.0373003 0.042973 -0.0173867 0.0637547 -0.0278418 0.117274 0.0886919 0.0797417 0.0878866 -0.0465627 -0.0037639 0.0595987 -0.0802985 0.0637364 0.1064612 0.0877188 -0.0873257 0.0888579 0.0042358 -0.1237376 0.0180873 0.0366921 0.0172354 0.1477664 0.0270649 0.0388673 0.0266657 0.0979503 unknown
polarizability: 121.88714|-7.4558454|60.7775674|4.4350796|-12.5054562|97.2861169 unknown
InChI: InChI=1S/C9H9N/c1-8(7-10)9-5-3-2-4-6-9/h2-6,8H,1H3
charge 0 multiplicity 1
19 atoms
N  3.022254 -0.021056 1.726697
C  1.488627 -0.12924 -0.45886
C  -0.010579 -0.016488 -0.13958
C  1.801402 -1.439584 -1.250769
C  -0.558799 -0.533121 1.059486
C  -0.875582 0.562793 -1.100875
C  -1.951439 -0.473821 1.29126
C  -2.26799 0.621791 -0.870607
C  -2.810713 0.101378 0.327071
C  2.32999 -0.061045 0.755579
H  1.77696 0.73113 -1.095484
H  1.203015 -1.458296 -2.177666
H  1.536916 -2.325963 -0.64992
H  2.871787 -1.496023 -1.514054
H  0.102692 -0.96741 1.818445
H  -0.460507 0.975022 -2.029543
H  -2.363799 -0.87153 2.225166
H  -2.925522 1.076991 -1.619545
H  -3.889911 0.149574 0.5093
