program: Gaussian 09
title: 000187025
version: EM64L-G09RevD.01
frameworkgroup: C1[X(C17H19N5O5)]
method: RPBEPBE
basis: SDD
operation: Freq
keyword: #p
keyword: freq=noraman
keyword: PBEPBE/SDD
title: #p freq=noraman PBEPBE/SDD
converged: YES YES NO NO
title: Mulliken charges:
elementType: O O O O O N N N N N C C C C C C C C C C C C C C C C C H H H H H H H H H H H H H H H H H H H
charge: -0.292642 -0.447213 -0.449952 -0.492323 -0.222066 -0.247930 -0.030432 -0.466678 -0.046192 -0.639503 -0.122294 -0.126073 -0.290734 0.009477 -0.374821 0.338441 0.089395 -0.175150 0.315412 -0.012142 0.119081 -0.348837 -0.366791 -0.481434 -0.366233 0.450526 -0.809864 0.317350 0.271440 0.256203 0.251047 0.265412 0.231750 0.369038 0.370808 0.404450 0.369886 0.278321 0.279927 0.231644 0.231512 0.343109 0.327404 0.233287 0.223442 0.230942
chargesum: 0.00000
title: Mulliken charges with hydrogens summed into heavy atoms:
elementType: O O O O O N N N N N C C C C C C C C C C C C C C C C C
charge: -0.292642 -0.078174 -0.079144 -0.122438 -0.222066 -0.247930 -0.030432 -0.062228 -0.046192 0.031010 0.195056 0.145366 -0.034530 0.260525 0.122341 0.338441 0.089395 -0.175150 0.315412 -0.012142 0.119081 -0.070516 -0.086864 -0.249790 -0.134721 0.450526 -0.122194
polarizability: 3.74596796e+02 -2.01941694e+01 2.68305615e+02 -4.42685887e+00 3.68860931e+00 1.30322773e+02
1716.lowfreq: -10.6095 -5.7415 -0.0010 -0.0009 -0.0007 6.7482 25.4833 35.9485 39.2625
frequency: 24.9194 35.8774 39.2550 48.9473 60.2331 70.9211 74.0613 108.3668 121.1788 129.7247 143.0704 146.9050 182.1119 196.6360 209.8409 224.0058 232.1875 242.7275 261.5487 272.6965 281.1822 295.5928 309.9766 312.0766 340.4334 342.9866 351.6317 376.0276 413.0501 424.5827 434.9433 485.4631 487.0144 503.0257 526.1101 529.6378 543.4094 545.8072 592.0025 597.7518 631.3723 634.7732 647.2219 658.0791 681.5333 692.6625 700.3663 724.8042 732.1740 767.1140 780.5744 785.9182 813.2352 829.1424 835.3179 838.3368 856.8707 864.5296 910.0714 932.4196 957.1917 960.2856 979.2483 984.7360 989.6591 994.5859 1001.8572 1010.0303 1020.3635 1026.7900 1047.6280 1055.5969 1065.0890 1093.7251 1105.1264 1133.5328 1157.4971 1163.2777 1173.0120 1204.5628 1209.6389 1230.8405 1243.2524 1260.8122 1265.2596 1278.2619 1281.6038 1305.0039 1316.8661 1319.0610 1322.1616 1329.5878 1340.5352 1345.6478 1357.2629 1358.5109 1372.1473 1397.6306 1399.3581 1405.7929 1415.7671 1448.1711 1459.4426 1469.2006 1474.2949 1521.3309 1523.3948 1534.1156 1577.2771 1601.4538 1618.2802 1624.5331 1640.9648 2975.2253 2989.5509 3008.6788 3023.3236 3025.1297 3053.0038 3065.4390 3083.6311 3106.2036 3122.8949 3126.3351 3165.1171 3169.8176 3362.9341 3460.9120 3528.5023 3577.8430 3600.0823 3689.6935
redmass: 3.9977 1.1404 4.7573 5.3154 5.4260 4.8961 6.1106 5.7467 5.3307 4.5847 7.1787 5.8631 5.5965 7.2814 3.5951 5.4870 6.2298 5.7303 5.2306 5.1270 3.3129 3.9983 1.5081 1.2494 3.5818 3.7988 3.4609 4.8284 3.0058 3.4234 1.1399 7.7287 4.7622 2.8868 1.1886 1.6473 4.2316 3.2949 6.4712 4.9638 5.9375 6.8904 10.6467 5.3646 6.5293 6.3826 7.9197 5.6393 3.3562 2.8773 1.7835 5.1353 4.6566 1.6828 3.8967 2.5303 1.4057 3.6053 4.5507 3.4940 6.5322 1.3569 3.6011 1.4545 1.6008 2.2622 2.3999 2.9523 3.5002 2.9074 1.5610 4.7432 4.9676 3.8334 1.9693 1.3791 1.2617 2.7271 1.1698 1.1718 1.3220 2.6834 4.8460 1.2000 2.3911 1.5509 1.5514 1.6813 1.3368 1.5410 1.2837 1.3244 2.1611 2.1943 2.6628 1.7910 1.4321 1.3224 3.6474 1.6116 3.5317 1.0764 3.2149 1.0499 1.1788 3.9951 3.9316 4.7196 5.4741 1.3342 9.6971 6.1993 4.2802 1.0372 1.0824 1.0855 1.0793 1.0720 1.0974 1.0868 1.0988 1.1045 1.0897 1.0898 1.0943 1.0938 1.0820 1.0647 1.0457 1.0668 1.0669 1.1043
irintensity: 4.4154 0.3316 4.0367 2.0612 1.0013 4.0723 8.4073 3.0451 1.3270 0.1997 5.4530 2.0751 4.6333 0.2699 2.2827 2.8147 4.6333 10.3009 6.5236 42.9575 29.6594 21.4377 37.1862 119.2158 5.9620 1.7988 0.9314 7.6782 0.1142 23.1340 107.4667 4.4135 14.5931 14.7573 209.2404 123.7016 9.6177 25.7198 0.5137 11.4002 10.8953 0.5878 5.4733 0.6540 12.5006 14.2478 12.4935 8.1622 11.2926 75.6821 52.4153 10.3233 2.1144 56.7172 9.2010 3.1691 14.4514 60.7782 47.8306 69.5502 44.5337 4.9972 56.8176 1.0839 1.4857 20.4439 79.0034 3.8260 38.2574 30.2373 13.1614 99.5034 36.6788 32.3545 12.3567 13.5858 69.8653 5.8382 12.8329 1.9076 9.2997 0.2841 36.3286 7.6878 11.5789 16.2471 1.0884 6.2576 2.5726 55.2032 6.5956 39.8660 31.9265 73.2691 1.6199 12.3145 26.1669 8.7639 280.7910 15.4218 21.4617 12.0845 13.5487 12.7297 8.3601 227.7994 12.7804 177.2353 4.6627 77.5608 472.2349 7.1670 502.5658 50.4606 14.2743 6.4590 9.3275 81.1208 20.3946 2.6167 19.1257 6.6699 20.3207 27.4646 4.7162 0.2715 499.8522 44.1282 112.4052 25.9851 23.9889 69.8342
temp: 298.150 k
press: 1.00000 atm
elementType: 8 8 8 8 8 7 7 7 7 7 6 6 6 6 6 6 6 6 6 6 6 6 6 6 6 6 6 1 1 1 1 1 1 1 1 1 1 1 1 1 1 1 1 1 1 1
symmnumber: 1
zpe: 929139.6 jmol-1
zpe.correction: 0.353891 hartree
zpe.thermalcorrener: 0.378661 hartree
zpe.thermalcorrenthalpy: 0.379605 hartree
zpe.thermalcorrgfe: 0.299084 hartree
zpe.sumelectzpe: -1307.100606 hartree
zpe.sumelectthermal: -1307.075836 hartree
zpe.sumelectthermalent: -1307.074892 hartree
zpe.sumelectthermalfe: -1307.155413 hartree
dipole: -5.0007 -14.7492 0.6165
dipole: 15.5861
quadrupole: -114.8009 -193.0008 -152.8745
quadrupole: 23.1161 -3.6474 -17.4503
quadrupole: 38.7578 -39.4421 0.6842 23.1161 -3.6474 -17.4503
hfenergy: -1307.454497 hartree
pointgroup: C01 [X(C17H19N5O5)]
dipole: -0.6398315 -6.0653377 0.6358527 debye
polarizability: 377.7385567|3.8790521|264.5726478|-11.3022618|-5.8117461|130.9139791 unknown
InChI: InChI=1S/C17H19N5O5/c1-7-2-4-8(5-3-7)13-19-10-14(20-17(18)21-15(10)26)22(13)16-12(25)11(24)9(6-23)27-16/h2-5,9,11-12,16,20,23-25H,6,18H2,1H3
charge 0 multiplicity 1
46 atoms
O  -0.991116 -1.958149 -1.162786
O  1.320959 -3.187625 0.750197
O  -0.99136 -4.283387 1.649384
O  -3.786139 -2.450816 -0.344723
O  -2.046639 4.248648 0.482505
N  -0.090938 0.041508 -0.200732
N  0.312142 2.281125 0.079444
N  -2.60513 0.170023 -0.144138
N  -3.484872 2.413175 0.164119
N  -4.921038 0.580535 -0.170413
C  0.147598 -1.389638 -0.397457
C  0.237231 -2.224145 0.919097
C  -1.118243 -2.98372 0.977489
C  -1.419865 -3.22201 -0.515912
C  -2.875651 -3.477018 -0.90594
C  -1.324189 0.685277 -0.082891
C  0.90343 1.083971 -0.097487
C  -1.068211 2.056017 0.093963
C  2.363353 0.913708 -0.194795
C  -2.182303 3.012859 0.269088
C  -3.646875 1.115215 -0.043931
C  3.083838 -0.266411 0.13938
C  3.109274 2.055165 -0.616096
C  4.491541 -0.304562 0.022217
C  4.508461 2.005269 -0.722325
C  5.231821 0.820248 -0.413372
C  6.744112 0.776872 -0.535749
H  1.078176 -1.520166 -0.972833
H  0.415201 -1.57955 1.800185
H  -1.895482 -2.350253 1.447191
H  -0.795885 -4.065151 -0.878221
H  -2.97654 -3.398149 -2.000119
H  -3.178065 -4.490078 -0.58258
H  1.039169 -4.034282 1.195818
H  -1.146771 -4.18433 2.622185
H  -2.817592 -0.814913 -0.362934
H  -4.173538 -2.763413 0.508737
H  2.5880 -1.160757 0.526659
H  2.557899 2.972174 -0.845139
H  5.02006 -1.22816 0.287116
H  5.053202 2.898415 -1.052613
H  -5.687645 1.248565 -0.147207
H  -5.066602 -0.361443 -0.530952
H  7.222131 1.506165 0.145638
H  7.142583 -0.222962 -0.292106
H  7.071408 1.031158 -1.561461
