program: Gaussian 09
title: 000184860
version: EM64L-G09RevD.01
frameworkgroup: C1[X(C21H19NO3)]
method: RPBEPBE
basis: SDD
operation: Freq
keyword: #p
keyword: freq=noraman
keyword: PBEPBE/SDD
title: #p freq=noraman PBEPBE/SDD
converged: YES YES NO NO
title: Mulliken charges:
elementType: O O O N C C C C C C C C C C C C C C C C C C C C C H H H H H H H H H H H H H H H H H H H
charge: -0.275275 -0.309047 -0.248417 -0.015729 0.347382 0.324258 -0.288114 -0.358315 -0.320041 -0.334119 -0.393027 -0.319806 0.342094 -0.359892 -0.383993 0.419595 -0.206639 -0.194185 -0.255187 -0.371577 -0.361064 -0.344846 -0.220522 -0.216858 -0.232349 0.214633 0.240064 0.252355 0.252450 0.267539 0.255452 0.233527 0.227179 0.265057 0.255549 0.226157 0.228170 0.228489 0.228072 0.263363 0.244552 0.230420 0.230432 0.232211
chargesum: 0.00000
title: Mulliken charges with hydrogens summed into heavy atoms:
elementType: O O O N C C C C C C C C C C C C C C C C C C C C C
charge: -0.275275 -0.309047 -0.248417 -0.015729 0.347382 0.324258 0.166582 -0.105960 -0.067590 -0.066580 -0.137575 0.140900 0.342094 -0.094834 -0.128444 0.419595 0.019517 0.033985 -0.026698 -0.143504 -0.097700 -0.100294 0.009898 0.013575 -0.000138
polarizability: 4.10557928e+02 2.89140541e+01 2.31899972e+02 2.48688630e+01 -1.25397896e+01 1.52000284e+02
1716.lowfreq: -10.1056 -3.8905 -0.0008 0.0001 0.0007 2.6625 10.3004 14.2367 19.7182
frequency: 9.1233 14.0955 19.6126 27.5018 37.1098 54.7306 68.4802 80.7917 110.3853 126.1141 136.6239 165.9131 179.7691 202.4085 213.5965 254.9512 296.3718 306.3650 308.6860 338.9954 361.1714 388.5888 403.0611 410.9442 419.5699 467.7109 487.8161 502.9928 512.6990 539.5401 555.2816 590.7501 609.5733 613.6802 621.8942 635.8501 691.4805 697.9624 702.4601 724.2884 760.8011 770.1993 792.9975 804.5341 822.2797 830.0953 836.0170 838.8087 853.0217 853.8887 879.2410 903.1504 921.6955 931.4716 956.1199 961.2708 968.5302 983.4758 985.2704 985.5866 987.1089 988.3189 996.5026 998.0687 1001.6400 1019.5404 1024.1361 1078.2056 1083.3381 1086.6031 1109.7392 1119.9877 1150.1562 1166.3971 1170.5183 1173.8155 1180.6119 1185.9982 1199.2716 1202.0171 1224.2919 1238.6982 1277.8573 1292.1312 1309.1643 1316.7674 1321.0373 1341.2654 1366.1866 1384.5126 1385.7452 1389.5411 1419.5608 1435.0503 1442.8801 1457.7128 1470.0261 1480.1607 1482.6110 1493.6810 1555.4004 1585.5788 1591.1223 1595.2745 1605.8786 1611.7566 1624.1288 2969.6403 3030.1378 3036.9716 3060.2764 3111.8770 3121.9777 3129.0749 3131.1922 3138.2832 3144.1763 3151.3811 3155.9389 3156.0222 3157.4547 3164.5985 3168.9096 3171.3507 3173.5102 3176.4496
redmass: 5.6435 5.5678 3.9584 4.6355 5.4345 4.1717 5.2978 5.4876 4.2025 5.3126 2.3446 6.6190 4.9050 4.3382 4.8401 4.0222 4.5939 5.3646 5.1408 6.1606 5.6734 6.2864 2.8211 2.9520 3.0550 4.7459 3.2916 2.7797 3.0541 5.3659 6.5884 4.7919 6.4955 6.4731 6.0867 6.7941 2.3942 1.7748 4.4582 3.7433 1.6870 1.7355 5.7567 1.2771 1.9584 2.0418 1.3877 1.4497 5.9374 1.2588 4.1243 1.4197 1.3584 1.3523 1.3357 1.5308 1.3518 1.3876 1.5965 3.2788 6.8744 6.5864 4.2642 3.7952 1.3309 2.0993 2.1426 1.5002 1.6159 3.1912 1.2757 1.5911 1.8895 1.1254 1.1357 1.0601 1.5787 1.1154 1.5992 1.7684 1.8353 6.1587 1.1147 1.2958 1.3365 1.3514 1.3609 1.6939 3.7871 3.3181 5.9456 2.4165 3.9282 2.3326 2.3403 1.0901 2.1658 1.5216 2.3813 1.5571 6.3768 7.1771 6.1511 6.6442 6.4094 6.0167 6.7931 1.0554 1.0600 1.1052 1.0893 1.1079 1.0868 1.0849 1.0871 1.0892 1.0921 1.0882 1.0885 1.0919 1.0960 1.0958 1.1012 1.0968 1.1003 1.0968
irintensity: 0.0553 0.2696 0.2193 0.5241 0.4411 0.5635 0.3660 0.3866 0.3644 1.5493 2.1726 2.6076 7.3666 5.2040 1.7046 8.0825 5.0385 0.6027 6.2664 3.4048 1.1727 1.8822 0.0687 0.8229 0.3783 17.2472 11.8683 32.3312 21.0574 17.9089 33.1634 0.9527 7.0909 1.7277 10.6649 1.1315 29.6698 51.9214 1.0862 12.9367 92.8471 48.7232 35.3057 13.6259 44.0933 14.0788 3.6175 36.4237 54.0488 0.1528 127.1053 5.4387 0.4547 0.3234 0.2834 33.5756 0.2543 0.4320 0.3435 1.9929 7.2596 13.6279 85.8098 257.1230 1.9389 13.5523 1.4902 10.7885 8.5058 12.5874 15.0935 0.6443 6.2522 5.1857 0.3251 0.8344 199.9039 2.5362 374.8169 324.5784 15.8097 9.0009 0.8415 2.9725 0.5827 1.1570 5.6673 1.2811 16.4519 3.8314 1.4587 3.0077 3.1422 10.8491 2.2273 19.3610 353.4207 149.2844 7.9372 116.6031 2.0223 10.8684 1.0336 38.1041 47.7840 0.5777 20.5820 31.4859 49.5648 22.1257 13.6050 18.5002 6.8185 2.4942 0.2795 12.7322 20.9504 15.1691 29.7038 12.2720 25.3605 13.8323 20.8585 6.7931 10.2749 2.1213
temp: 298.150 k
press: 1.00000 atm
elementType: 8 8 8 7 6 6 6 6 6 6 6 6 6 6 6 6 6 6 6 6 6 6 6 6 6 1 1 1 1 1 1 1 1 1 1 1 1 1 1 1 1 1 1 1
symmnumber: 1
zpe: 906151.0 jmol-1
zpe.correction: 0.345135 hartree
zpe.thermalcorrener: 0.367313 hartree
zpe.thermalcorrenthalpy: 0.368257 hartree
zpe.thermalcorrgfe: 0.288279 hartree
zpe.sumelectzpe: -1090.209788 hartree
zpe.sumelectthermal: -1090.187610 hartree
zpe.sumelectthermalent: -1090.186666 hartree
zpe.sumelectthermalfe: -1090.266644 hartree
dipole: -1.8538 0.0618 -0.7984
dipole: 2.0194
quadrupole: -116.3743 -140.0107 -145.1893
quadrupole: 11.0715 7.7667 -3.8024
quadrupole: 17.4838 -6.1526 -11.3312 11.0715 7.7667 -3.8024
hfenergy: -1090.5549231 hartree
pointgroup: C01 [X(C21H19N1O3)]
dipole: -0.7396815 -0.2567102 0.134817 debye
polarizability: 412.5669908|-2.0000436|188.6241368|-30.7078143|42.5809353|193.2670561 unknown
InChI: InChI=1S/C21H19NO3/c1-3-7-18(8-4-1)17-22-24-16-15-23-19-11-13-21(14-12-19)25-20-9-5-2-6-10-20/h1-14,17H,15-16H2
charge 0 multiplicity 1
44 atoms
O  -0.127342 -0.509969 -1.852366
O  4.401558 0.552157 1.334288
O  -3.671006 -1.611286 -1.877272
N  -4.336902 -0.524617 -1.147618
C  0.973758 -0.287767 -1.006435
C  3.299281 0.212183 0.503316
C  -1.380401 -0.958391 -1.230139
C  2.157982 0.15061 -1.650865
C  0.953992 -0.468198 0.398448
C  3.319137 0.406308 -0.899929
C  2.124848 -0.217967 1.149466
C  -2.381699 -1.104814 -2.380629
C  5.719438 0.170274 0.980833
C  6.016894 -0.956266 0.177608
C  6.751901 0.948597 1.552074
C  -6.386098 -0.052857 0.06744
C  7.369598 -1.291619 -0.057343
C  8.097258 0.598277 1.310278
C  8.414224 -0.519959 0.502123
C  -7.630241 -0.561987 0.532375
C  -6.040399 1.298885 0.357404
C  -5.500155 -0.943386 -0.696898
C  -8.510663 0.258104 1.270164
C  -6.921539 2.113029 1.093835
C  -8.159761 1.597945 1.553794
H  -1.232472 -1.929595 -0.716024
H  -1.748783 -0.209677 -0.501644
H  2.144753 0.294727 -2.735356
H  0.048724 -0.798896 0.915265
H  4.228105 0.761836 -1.395037
H  2.13376 -0.346941 2.235763
H  -2.046643 -1.869042 -3.101157
H  -2.52725 -0.139826 -2.896462
H  5.211961 -1.56488 -0.245623
H  6.484053 1.808309 2.173658
H  7.60357 -2.165392 -0.675959
H  8.89828 1.201365 1.751983
H  9.459416 -0.787524 0.314698
H  -7.904413 -1.601491 0.313412
H  -5.083439 1.69041 -0.002526
H  -5.836252 -1.976077 -0.886649
H  -9.4663 -0.145545 1.622195
H  -6.648649 3.15147 1.312319
H  -8.842086 2.235886 2.12629
