program: Gaussian 09
title: 000184842
version: EM64L-G09RevD.01
frameworkgroup: C1[X(C24H26N2O)]
method: RPBEPBE
basis: SDD
operation: Freq
keyword: #p
keyword: freq=noraman
keyword: PBEPBE/SDD
title: #p freq=noraman PBEPBE/SDD
converged: YES YES NO NO
title: Mulliken charges:
elementType: O N N C C C C C C C C C C C C C C C C C C C C C C C C H H H H H H H H H H H H H H H H H H H H H H H H H H
charge: -0.436533 -0.139599 -0.089383 -0.379809 -0.367174 -0.384493 -0.382438 -0.312762 -0.484304 0.448572 0.464146 0.464847 -0.435813 -0.452671 -0.369346 -0.348228 -0.353025 -0.430966 -0.226227 -0.224965 -0.246532 -0.242081 -0.245044 -0.245201 -0.389238 -0.343709 0.276545 0.233826 0.192789 0.187790 0.231494 0.224875 0.192001 0.183221 0.204424 0.194617 0.217468 0.192599 0.225793 0.227774 0.259352 0.243847 0.265982 0.233981 0.222516 0.223460 0.223390 0.223814 0.226854 0.226970 0.216534 0.248462 0.351596
chargesum: 0.00000
title: Mulliken charges with hydrogens summed into heavy atoms:
elementType: O N N C C C C C C C C C C C C C C C C C C C C C C C C
charge: -0.084937 -0.139599 -0.089383 0.046806 0.052110 0.032384 0.005207 -0.118145 -0.074238 0.448572 0.464146 0.464847 -0.210020 -0.224897 -0.109994 -0.104381 -0.087043 -0.196984 -0.003711 -0.001506 -0.023142 -0.018267 -0.018190 -0.018231 -0.172705 -0.095246 0.276545
polarizability: 3.08376090e+02 -3.18403897e+01 2.50536280e+02 6.01782712e+00 3.40296759e+00 2.48438527e+02
1716.lowfreq: -11.6071 -4.5844 -3.9519 -0.0007 -0.0004 0.0006 12.3236 21.8008 25.6497
frequency: 11.8297 21.7123 25.5981 30.0678 46.8536 51.8205 59.8459 78.1441 85.5598 131.9594 145.1976 184.2113 213.7839 219.8874 233.9891 258.0430 266.5556 288.2912 310.8487 329.1130 338.6517 346.0614 348.1541 397.9276 402.1040 406.9263 410.3116 413.3162 466.0841 474.3279 483.0529 502.9525 530.4915 565.4191 604.8332 612.7263 617.7854 624.4139 637.4507 647.4765 699.6328 707.4256 711.5454 753.8479 754.9782 759.4970 776.1875 811.4130 816.1965 824.9610 832.4623 833.5414 847.1975 847.5514 850.7531 861.1350 918.3274 932.7493 935.4242 951.3195 966.4200 973.9975 984.3318 989.7602 991.2575 993.1424 996.8739 1001.6441 1003.3681 1008.3166 1018.7729 1024.8555 1027.8425 1059.4464 1072.9360 1080.7379 1093.5713 1103.3744 1114.6921 1134.6736 1139.5732 1143.5650 1161.6812 1169.6525 1170.2562 1171.0084 1178.9568 1184.3597 1188.6620 1191.7206 1203.8197 1210.5773 1227.8412 1243.5427 1260.0612 1272.1613 1281.4072 1296.4006 1304.4088 1308.6836 1330.2579 1334.4333 1335.0167 1343.2716 1362.6549 1378.6147 1381.4656 1383.7517 1392.5166 1399.1912 1425.9548 1439.0331 1440.8892 1452.8478 1456.9560 1461.6168 1469.2828 1475.0648 1476.5572 1480.5440 1502.5125 1592.5198 1594.6157 1599.8262 1608.1177 1612.7537 1627.2808 2824.6545 2840.7570 2848.6316 2860.1409 2866.6434 2877.2238 2980.7508 3023.0725 3044.8152 3063.7451 3066.5889 3107.6831 3111.7757 3113.7891 3120.2237 3121.7293 3124.0231 3134.7829 3136.9309 3145.2505 3148.3627 3149.2285 3161.0001 3162.7162 3168.5580 3581.9790
redmass: 4.3668 4.6091 5.4456 3.7411 4.6236 4.1961 4.8228 4.1959 3.2306 5.0306 4.4500 4.6234 4.9547 3.5341 3.6545 3.0799 3.0618 3.1320 3.3667 4.0172 2.3079 3.7671 1.1728 3.4295 2.7937 2.3840 2.3641 2.9459 3.1793 4.3825 3.1701 2.8999 3.9952 4.1248 5.3414 4.4945 6.0984 3.4866 5.6428 3.3544 1.8025 3.2227 1.7164 1.7948 3.9111 2.6558 3.4414 1.8711 2.1818 2.8127 2.2096 2.6229 1.9609 1.9136 1.4586 1.2733 1.4562 1.5779 1.4988 1.6297 1.3507 1.3972 1.4133 6.0225 4.7027 1.3544 2.2427 1.8010 1.8173 2.0129 2.8367 2.1061 2.2192 1.7548 1.5929 1.7388 1.6058 1.7947 2.4251 2.6678 3.8116 1.3949 2.3298 1.0694 1.1085 1.0637 1.1501 1.3732 1.7954 1.3166 1.7431 2.0675 1.3069 2.8548 1.5282 1.5007 1.4917 1.3848 1.2764 1.3929 1.2905 1.3297 1.2872 1.3235 1.4869 2.4844 1.9906 6.0764 2.3149 3.2878 2.6007 2.1132 2.1291 1.0875 1.0854 1.0974 1.1033 1.1162 2.2615 2.2798 2.6886 6.0608 6.1981 6.4975 6.1589 6.1524 6.4580 1.0809 1.0707 1.0712 1.0699 1.0710 1.0691 1.0863 1.0891 1.0888 1.0870 1.0888 1.0892 1.0871 1.0868 1.0896 1.0859 1.0863 1.0911 1.0917 1.0955 1.0942 1.0951 1.1013 1.1012 1.0950 1.0660
irintensity: 0.1936 0.1320 0.4266 0.3911 0.0473 0.4367 0.0321 0.6081 0.0469 2.8690 2.7525 1.0812 0.1824 0.4565 0.1350 1.4016 1.0458 0.5111 3.5205 2.1390 6.9163 0.4700 145.1545 8.8464 0.0512 0.3260 0.1426 1.4138 1.9353 2.4639 4.9866 26.5863 10.1788 12.9318 7.6541 0.4259 3.4977 8.4861 1.8854 5.6902 29.5834 1.6228 80.5016 36.9713 36.1330 14.3833 10.0520 20.1666 36.5618 10.7277 43.0888 13.6258 1.3809 0.2118 0.5827 0.0554 2.7085 15.9435 10.1831 2.6070 2.0572 0.1113 1.3829 0.4838 1.3853 6.6707 73.8502 0.0260 10.8241 7.5480 0.1528 13.3665 1.9732 0.3400 0.7920 22.2489 40.4852 10.7876 21.4003 115.4156 31.5491 194.9660 2.1548 0.8459 9.2741 0.2866 2.5329 5.0911 4.5427 1.0950 0.7152 4.1660 0.4299 26.3138 8.6843 7.3925 19.2521 29.2279 1.9649 8.6852 1.4270 47.6029 3.2952 15.7931 9.0111 1.2146 5.3305 0.1673 4.4876 2.5724 12.1021 5.0777 19.7701 4.3057 1.2674 11.5247 12.7155 5.1046 26.6476 9.9415 96.9975 0.2261 2.2924 13.2902 12.4312 2.1494 29.8453 45.1097 45.2692 73.3830 28.4434 11.0540 255.2884 23.5652 46.6585 27.4838 38.0061 12.0995 21.7637 7.7044 7.7967 12.7757 0.2729 0.2429 12.4673 30.7629 16.7689 6.8070 43.3846 33.7135 21.4261 8.9054 37.4416
temp: 298.150 k
press: 1.00000 atm
elementType: 8 7 7 6 6 6 6 6 6 6 6 6 6 6 6 6 6 6 6 6 6 6 6 6 6 6 6 1 1 1 1 1 1 1 1 1 1 1 1 1 1 1 1 1 1 1 1 1 1 1 1 1 1
symmnumber: 1
zpe: 1156435.3 jmol-1
zpe.correction: 0.440463 hartree
zpe.thermalcorrener: 0.464051 hartree
zpe.thermalcorrenthalpy: 0.464995 hartree
zpe.thermalcorrgfe: 0.383946 hartree
zpe.sumelectzpe: -1112.906284 hartree
zpe.sumelectthermal: -1112.882696 hartree
zpe.sumelectthermalent: -1112.881752 hartree
zpe.sumelectthermalfe: -1112.962802 hartree
dipole: 1.0186 -0.4847 1.2526
dipole: 1.6857
quadrupole: -170.8263 -155.4289 -141.1418
quadrupole: -1.7561 -5.7237 3.2152
quadrupole: -15.0273 0.3701 14.6572 -1.7561 -5.7237 3.2152
hfenergy: -1113.3467473 hartree
pointgroup: C01 [X(C24H26N2O1)]
dipole: -0.4001132 0.2173261 0.4821816 debye
polarizability: 309.0536291|-31.5053267|249.3592469|-4.3164538|-3.3465754|248.9380208 unknown
InChI: InChI=1S/C24H26N2O/c27-23-13-11-20(12-14-23)19-25-15-17-26(18-16-25)24(21-7-3-1-4-8-21)22-9-5-2-6-10-22/h1-14,24,27H,15-19H2
charge 0 multiplicity 1
53 atoms
O  7.908553 -0.936566 1.041671
N  -0.8999 0.301371 -0.074778
N  1.879477 1.116361 -0.403452
C  0.229048 -0.60609 0.276192
C  -0.469966 1.711063 0.133491
C  1.461724 -0.294727 -0.583783
C  0.759699 2.029681 -0.730767
C  -2.144317 -0.043874 0.6781
C  3.123406 1.449168 -1.135306
C  -2.620094 -1.469582 0.34695
C  -3.279244 0.952566 0.388256
C  4.360802 0.779613 -0.545308
C  -3.232619 -2.256751 1.351438
C  -3.994158 1.544763 1.456374
C  -2.51517 -1.996177 -0.965347
C  -3.657338 1.263501 -0.943071
C  4.509667 0.645463 0.856938
C  5.41104 0.323765 -1.381009
C  -3.740639 -3.541669 1.054017
C  -5.071737 2.426098 1.205984
C  -3.01646 -3.281243 -1.264997
C  -4.726739 2.147996 -1.197108
C  -3.635617 -4.058667 -0.257654
C  -5.442013 2.730763 -0.123113
C  5.674992 0.077623 1.413889
C  6.585651 -0.241164 -0.841991
C  6.715823 -0.362091 0.559559
H  -0.079847 -1.651243 0.107901
H  0.504973 -0.497415 1.35553
H  -0.214731 1.899397 1.20704
H  -1.29538 2.38684 -0.144901
H  2.296251 -0.953407 -0.284059
H  1.220432 -0.510882 -1.656033
H  0.465265 1.953566 -1.808941
H  1.081036 3.070697 -0.536846
H  -1.950357 -0.005466 1.782761
H  3.241725 2.551016 -1.081033
H  3.052206 1.193564 -2.224224
H  -3.317817 -1.860332 2.371342
H  -3.70547 1.317663 2.490457
H  -2.019806 -1.393875 -1.735229
H  -3.100803 0.815758 -1.773509
H  3.689787 0.981106 1.501322
H  5.311588 0.409042 -2.470397
H  -4.213236 -4.138242 1.842675
H  -5.616068 2.87543 2.044417
H  -2.924995 -3.677715 -2.282912
H  -5.007032 2.381141 -2.23084
H  -4.026669 -5.055477 -0.490919
H  -6.27571 3.413903 -0.321056
H  5.773073 -0.021112 2.503575
H  7.398617 -0.594958 -1.482953
H  7.900995 -0.978093 2.030059
