program: Gaussian 09
title: 000015747
version: EM64L-G09RevD.01
frameworkgroup: C1[X(C3H3F5)]
method: RPBEPBE
basis: SDD
operation: Freq
keyword: #p
keyword: freq=noraman
keyword: PBEPBE/SDD
title: #p freq=noraman PBEPBE/SDD
converged: NO NO NO NO
title: Mulliken charges:
elementType: F F F F F C C C H H H
charge: -0.174110 -0.174198 -0.153371 -0.153586 -0.132103 0.302617 0.388198 -0.689109 0.257860 0.269974 0.257828
chargesum: 0.00000
title: Mulliken charges with hydrogens summed into heavy atoms:
elementType: F F F F F C C C
charge: -0.174110 -0.174198 -0.153371 -0.153586 -0.132103 0.302617 0.388198 0.096553
polarizability: 3.38742507e+01 -1.02321543e+00 3.59258525e+01 -1.66862159e-03 -9.58288580e-04 3.56105954e+01
1716.lowfreq: -6.8253 -0.0013 -0.0007 0.0011 0.3198 13.0460 60.4761 193.0816 198.2822
frequency: 60.1574 193.0795 198.2764 214.3966 306.9537 317.1827 320.3682 398.7006 440.0877 518.4281 533.0264 572.1187 683.8421 872.1217 887.0663 1043.7796 1053.5541 1083.7606 1141.9159 1176.5341 1271.1989 1406.6496 1456.7994 1462.3481 3023.1914 3131.3637 3131.9295
redmass: 9.1065 3.5764 5.6446 1.3390 6.0883 5.7286 13.6885 5.6837 12.9664 12.1934 9.4843 5.8409 9.9904 2.9475 2.7933 12.0494 5.8934 4.2605 2.3348 5.6826 5.3476 1.2382 1.0438 1.0610 1.0358 1.1008 1.1009
irintensity: 1.5212 2.1340 4.9120 0.6591 2.0288 0.9309 0.3350 0.3485 12.1895 0.6679 1.1212 37.5333 2.0292 30.0087 44.1609 214.4274 208.6510 214.9559 127.8172 57.4670 0.1886 46.1119 12.2422 13.1064 0.0457 2.8822 2.4728
temp: 298.150 k
press: 1.00000 atm
elementType: 9 9 9 9 9 6 6 6 1 1 1
symmnumber: 1
zpe: 160890.7 jmol-1
zpe.correction: 0.061280 hartree
zpe.thermalcorrener: 0.069371 hartree
zpe.thermalcorrenthalpy: 0.070315 hartree
zpe.thermalcorrgfe: 0.028454 hartree
zpe.sumelectzpe: -614.693969 hartree
zpe.sumelectthermal: -614.685878 hartree
zpe.sumelectthermalent: -614.684934 hartree
zpe.sumelectthermalfe: -614.726796 hartree
dipole: -1.6739 2.5225 0.0010
dipole: 3.0273
quadrupole: -43.5184 -43.7502 -46.6245
quadrupole: -4.0062 0.0018 0.0012
quadrupole: 1.1126 0.8809 -1.9935 -4.0062 0.0018 0.0012
hfenergy: -614.7552493 hartree
pointgroup: C01 [X(C3H3F5)]
dipole: -0.6148769 1.0200623 -0.0007852 debye
dipolederiv: -0.3586794 -0.0543617 -0.1155902 -0.0353954 -0.4597272 -0.2453849 -0.0630562 -0.1871579 -0.5983833 -0.3582868 -0.0534263 0.1151316 -0.0344358 -0.458132 0.2449348 0.0624832 0.1867569 -0.600525 -0.4177124 -0.0942851 -0.1876456 -0.0466067 -0.4148374 -0.2153571 -0.089307 -0.2122947 -0.6247465 -0.4170565 -0.0932239 0.1872533 -0.0457206 -0.4139135 0.2149127 0.0887351 0.2120365 -0.6264943 -0.4557596 0.2765975 -0.0000818 0.1685477 -0.7379542 0.000355 0.0000671 0.0001437 -0.2624541 0.7727593 0.0203422 0.0004836 0.0083446 1.0083674 0.0003019 0.0005803 0.0003527 1.1602528 1.2106378 -0.1193614 0.0005785 -0.0138589 1.494272 0.0000015 0.0003869 0.0001005 1.4439803 -0.1683881 0.1777664 -0.0001793 0.0590201 -0.2643748 0.0002668 0.0000532 0.0001478 -0.0575942 0.1210207 -0.0227881 0.0648792 -0.0177912 0.0816648 0.0484649 0.0476742 0.068155 0.0093631 -0.0491466 -0.0139357 0.0003672 -0.0239141 0.0834445 0.000186 0.0004044 0.0001506 0.146409 0.1206116 -0.0233241 -0.0651964 -0.0181898 0.0811903 -0.0486814 -0.0480212 -0.0683909 0.0101923 unknown
polarizability: 33.7894266|-0.9304547|36.0106756|0.0027347|-0.0003632|35.6105964 unknown
InChI: InChI=1S/C3H3F5/c1-2(4,5)3(6,7)8/h1H3
charge 0 multiplicity 1
11 atoms
F  -1.174338 -0.776813 -1.142003
F  -1.171239 -0.772466 1.147474
F  1.256537 0.707313 1.133499
F  1.253525 0.704734 -1.13937
F  1.345027 -1.259553 -0.000776
C  -0.780683 -0.013828 0.000684
C  0.782754 0.021011 -0.001338
C  -1.45183 1.341973 -0.000889
H  -1.166874 1.908738 -0.901522
H  -2.543252 1.192413 0.001426
H  -1.163627 1.912379 0.896415
