program: Gaussian 09
title: 000184830
version: EM64L-G09RevD.01
frameworkgroup: C1[X(C6H10O2)]
method: RPBEPBE
basis: SDD
operation: Freq
keyword: #pfreq=noraman
keyword: PBEPBE/SDD
title: #p freq=noraman PBEPBE/SDD
converged: YES YES NO NO
title: Mulliken charges:
elementType: O O C C C C C C H H H H H H H H H H
charge: -0.175741 -0.151794 -0.122680 -0.368203 -0.707799 -0.699937 0.158072 -0.160101 0.244809 0.220433 0.199537 0.238329 0.227490 0.229503 0.234629 0.220048 0.207702 0.205703
chargesum: 0.00000
title: Mulliken charges with hydrogens summed into heavy atoms:
elementType: O O C C C C C C
charge: -0.175741 -0.151794 0.122129 0.051767 -0.012477 -0.037558 0.158072 0.045602
polarizability: 7.27994089e+01 4.19316574e-01 6.74712710e+01 -3.62974564e+00 -6.34055299e+00 6.20747639e+01
1716.lowfreq: -13.1066 -0.0006 -0.0005 -0.0003 2.9131 6.1505 37.0742 96.7588 116.6557
frequency: 36.8765 96.7402 116.6549 166.6159 178.4157 197.9513 219.3869 270.1736 326.2088 407.7254 495.2234 581.5452 624.0390 693.5156 805.1968 859.0684 938.1838 964.4173 1000.6131 1020.0652 1080.2134 1106.1445 1115.2997 1174.7816 1259.4542 1263.9092 1324.2354 1331.0114 1356.9631 1381.9408 1393.1540 1459.7656 1473.1287 1477.7309 1479.2939 1488.8092 1606.5162 1621.1864 2916.5091 2979.9718 2985.3727 2988.7472 2993.3486 3042.8095 3075.4822 3084.2729 3088.2418 3092.4186
redmass: 5.1552 2.0464 3.6735 3.2724 2.8624 1.1005 1.4104 2.0655 3.1017 2.9823 6.0929 3.1407 4.6839 2.1870 1.3455 1.9730 1.7274 1.3004 2.0460 1.9984 2.3512 1.8626 3.0103 2.0598 1.1863 1.3269 1.2739 1.3529 1.5980 1.2128 1.2152 1.0726 1.0567 1.0537 1.0516 1.0480 8.6027 9.6193 1.0890 1.0363 1.0365 1.0654 1.0754 1.1005 1.0996 1.1003 1.1007 1.1006
irintensity: 0.1338 0.0186 22.0422 3.2415 1.7043 0.1191 1.4901 0.1914 16.5551 0.0770 6.6328 0.4136 36.4907 12.8020 3.9123 4.5569 6.3008 8.9375 8.3551 10.3128 9.1730 0.5816 1.9026 4.0868 9.1369 2.5131 0.2992 0.4567 10.0940 6.3934 19.4666 4.4502 21.4546 0.8499 23.6636 11.6473 68.0564 64.4840 96.1763 32.8106 11.6492 18.6048 26.0974 4.5507 41.0314 27.7626 40.2626 25.4184
temp: 298.150 k
press: 1.00000 atm
elementType: 8 8 6 6 6 6 6 6 1 1 1 1 1 1 1 1 1 1
symmnumber: 1
zpe: 386629.0 jmol-1
zpe.correction: 0.147259 hartree
zpe.thermalcorrener: 0.157010 hartree
zpe.thermalcorrenthalpy: 0.157955 hartree
zpe.thermalcorrgfe: 0.111992 hartree
zpe.sumelectzpe: -384.418715 hartree
zpe.sumelectthermal: -384.408964 hartree
zpe.sumelectthermalent: -384.408020 hartree
zpe.sumelectthermalfe: -384.453982 hartree
dipole: -0.9709 1.0770 -0.1293
dipole: 1.4558
quadrupole: -50.2469 -48.2519 -53.1636
quadrupole: -2.6726 4.7977 3.2262
quadrupole: 0.3072 2.3022 -2.6094 -2.6726 4.7977 3.2262
hfenergy: -384.5659744 hartree
pointgroup: C01 [X(C6H10O2)]
dipole: -0.519685 -0.2351007 0.0519328 debye
dipolederiv: -0.558717 -0.0482923 0.0070549 -0.0762862 -0.4060628 0.1259023 0.1346427 0.2203948 -0.5574112 -0.5057992 0.0012781 -0.0839468 0.0139657 -0.3489511 0.1271127 -0.1242512 0.1268432 -0.6164239 -0.2320651 -0.1358902 0.0637901 -0.2189791 -0.2062128 0.1261855 0.0381665 0.0520377 0.0196094 0.1258886 -0.0024303 -0.034272 -0.0071717 0.0648957 -0.018935 0.0294388 -0.0102649 0.1077673 -0.0344188 -0.0136863 0.0283671 0.1262126 0.0712852 -0.0320107 0.0503114 0.0553401 0.0833518 0.0165508 0.0352139 0.0006724 0.015939 -0.060555 -0.0138159 -0.0203215 -0.0123789 0.0860227 0.7382295 0.2258117 -0.1009075 0.192047 0.3245791 -0.1913742 -0.2065441 -0.2671307 0.465758 0.6746297 0.0499414 0.0457917 0.0864694 0.2675237 -0.195576 -0.0209243 -0.2010854 0.6185129 0.0581987 0.0038845 -0.0239462 0.0119009 0.0706203 -0.0544196 -0.0207308 -0.0381763 -0.0795801 0.0942161 0.0131662 0.0269024 0.0274973 0.0337552 -0.042186 -0.0442601 -0.0438656 -0.1309334 -0.1152043 -0.0828351 0.0414789 -0.0953297 -0.0421209 0.0352213 0.0700015 0.045922 0.0619059 -0.0424236 0.1285282 -0.0658105 0.0927789 0.0090334 0.008412 -0.0647767 0.046212 0.0646958 0.0973888 -0.0236151 -0.0057584 -0.0112585 0.0489613 0.0083893 -0.0212189 -0.0740559 -0.1249113 -0.0682357 -0.097521 0.0855939 -0.0889784 0.0230743 0.0259081 0.0744023 0.0140173 0.0594891 -0.0443168 -0.132403 0.0628341 -0.0878379 0.0253668 0.0101974 0.0664856 0.044452 0.0548523 -0.1044293 0.1347561 -0.0684991 0.1134271 0.0007775 0.0200221 -0.0785665 0.0344282 0.0729831 0.0971665 -0.0069258 -0.0241581 0.0001193 0.0558407 0.0067722 0.006626 -0.059864 -0.1743851 -0.1966589 -0.0489809 0.0448132 -0.0945158 0.0681893 0.0541947 0.1315194 0.0671744 -0.0113032 unknown
polarizability: 71.3461651|-0.7834701|64.4464678|2.2420619|-8.0102804|66.5528108 unknown
InChI: InChI=1S/C6H10O2/c1-3-5(2)6(8)4-7/h4-5H,3H2,1-2H3
charge 0 multiplicity 1
18 atoms
O  0.611374 0.532608 -1.34401
O  1.891952 -0.731709 1.71116
C  -0.772348 -0.552705 0.393633
C  -2.018899 0.187825 -0.144905
C  -0.845705 -2.089428 0.116452
C  -2.087894 1.670497 0.28099
C  0.51985 -0.035908 -0.220922
C  1.833859 -0.243908 0.559003
H  -0.691749 -0.424522 1.492234
H  -2.026502 0.119156 -1.249482
H  -2.917395 -0.347646 0.219356
H  0.027229 -2.624659 0.528943
H  -0.905622 -2.287694 -0.968917
H  -1.752978 -2.499762 0.593809
H  -1.239156 2.244688 -0.131664
H  -3.016898 2.141468 -0.087691
H  -2.072178 1.772736 1.38261
H  2.736361 0.100263 -0.004296
