program: Gaussian 09
title: 000186941
version: EM64L-G09RevD.01
frameworkgroup: C1[X(C25H21NS)]
method: RPBEPBE
basis: SDD
operation: Freq
keyword: #p
keyword: freq=noraman
keyword: PBEPBE/SDD
title: #p freq=noraman PBEPBE/SDD
converged: YES YES NO NO
title: Mulliken charges:
elementType: S N C C C C C C C C C C C C C C C C C C C C C C C C C H H H H H H H H H H H H H H H H H H H H H
charge: -0.061603 -0.123287 -0.602400 0.236473 0.376707 0.550901 -0.483032 -0.413962 0.287335 -0.270865 0.331257 -0.374348 -0.426771 -0.394934 -0.357439 0.439800 -0.368257 -0.421303 -0.384831 -0.385993 -0.227418 -0.227149 -0.235236 -0.807746 -0.243606 -0.239620 -0.235518 0.271709 0.249434 0.259578 0.265477 0.263196 0.233799 0.256599 0.249471 0.229175 0.228618 0.237616 0.244475 0.233270 0.231227 0.233993 0.234330 0.226817 0.221863 0.228652 0.230719 0.232826
chargesum: 0.00000
title: Mulliken charges with hydrogens summed into heavy atoms:
elementType: S N C C C C C C C C C C C C C C C C C C C C C C C C C
charge: -0.061603 -0.123287 -0.081257 0.236473 0.376707 0.550901 -0.223454 -0.413962 0.287335 -0.005388 0.331257 -0.111152 -0.192972 -0.138335 -0.107968 0.439800 -0.139081 -0.192685 -0.147215 -0.141518 0.005852 0.004078 -0.001243 -0.124736 -0.014953 -0.008901 -0.002693
polarizability: 3.89976663e+02 -2.50795397e+01 2.98237574e+02 1.26771286e+01 3.07429763e+01 2.43462491e+02
1716.lowfreq: -5.7889 -3.1064 -0.0019 -0.0011 -0.0001 3.1068 13.3138 16.5845 25.2664
frequency: 13.2342 16.5692 25.2036 27.9521 36.3376 41.8455 55.5596 60.5045 78.4991 98.4234 130.6375 136.7468 187.2223 202.5742 229.1634 235.1826 258.6697 285.7317 316.9292 321.1675 345.2163 373.2497 397.0861 403.6896 404.5943 411.2320 434.8282 462.7395 481.8260 492.3112 539.9802 578.2401 596.0059 605.0449 612.4947 618.8855 629.9852 636.7819 646.1088 699.9583 702.0618 706.8351 716.9831 743.4658 760.0421 770.5401 780.5024 811.4981 813.6370 837.6333 847.7632 851.0379 852.2617 857.3141 864.3949 890.9876 926.9051 930.8015 935.5897 964.6366 976.1326 976.9425 980.7642 986.4220 988.9109 989.6627 998.0497 999.6483 1015.3006 1019.4079 1025.6926 1047.4022 1049.2132 1061.6757 1080.9626 1087.9958 1105.6537 1131.3209 1150.3947 1174.4414 1175.4739 1190.6819 1194.2624 1197.6616 1213.3969 1223.3038 1237.8026 1256.6774 1290.8686 1307.6115 1314.6812 1316.6770 1324.5370 1349.0567 1369.6916 1371.4910 1381.5046 1391.0420 1395.4025 1408.6348 1412.2428 1431.7192 1438.9481 1466.1780 1470.1289 1473.9608 1480.8038 1492.1650 1508.6695 1536.4821 1582.6799 1584.7172 1585.3525 1603.9708 1612.1073 1615.1604 1624.9905 2974.9559 2977.5261 3053.9123 3082.0968 3095.0969 3112.1976 3116.8993 3124.9270 3126.6320 3132.3971 3132.5723 3135.0277 3142.7156 3143.7095 3144.2966 3152.8487 3153.9987 3167.8662 3168.5447 3179.1383 3182.5145
redmass: 3.9251 3.3382 1.2451 3.9883 3.9734 3.8509 5.2069 6.8651 5.0886 5.1053 4.8577 4.3898 4.8616 5.4799 6.5933 5.0623 5.3901 4.5285 5.4844 4.2248 3.5443 4.1363 2.9107 2.8407 2.8996 2.8704 4.6812 3.2145 3.4583 3.8730 4.2613 3.6723 5.4383 6.0149 5.9258 6.3373 4.6171 6.6465 6.7842 1.7631 3.5272 1.8971 3.4806 3.0776 2.9750 1.8447 2.1024 5.2223 2.6548 2.6879 3.1547 1.2851 1.3356 1.3136 1.4829 1.4219 1.4771 1.4198 1.6216 1.5738 1.3847 1.4473 1.4323 1.4703 4.9926 5.1462 1.3220 1.3144 2.9641 3.3887 2.5190 1.5630 2.4034 2.8616 1.6222 1.6089 2.5541 1.5466 2.7923 1.0535 1.0539 1.1162 1.1377 1.1483 3.4359 2.6632 1.9515 1.6725 1.6690 2.0739 1.4281 1.4707 1.5383 1.8665 3.0939 4.6112 3.7345 3.6074 1.2623 2.9074 2.3997 2.2246 2.3746 1.1223 1.0478 1.1046 2.3582 2.5915 2.6369 7.0350 5.8967 5.9912 6.0025 6.2986 5.9616 6.4365 6.3036 1.0380 1.0682 1.0972 1.0991 1.0916 1.0871 1.0881 1.0864 1.0847 1.0873 1.0873 1.0963 1.0972 1.0923 1.0921 1.0965 1.0965 1.1016 1.1016 1.0914 1.0922
irintensity: 0.0400 0.7003 0.4864 0.2873 0.0563 0.0342 0.3692 1.1513 0.7484 0.2114 1.8485 0.3936 0.2755 1.2082 0.9761 0.0582 0.3485 1.2738 1.7213 3.6878 3.3017 0.8237 1.3372 0.6096 1.2645 5.2007 2.3108 1.8834 6.9629 15.8161 10.9648 13.5423 3.6469 3.8797 1.2664 1.7717 0.3316 0.5604 2.4705 38.9594 10.1955 47.3447 4.4585 2.9270 6.2765 88.3505 51.9971 3.7214 9.8139 24.2597 9.4149 2.7853 2.1569 1.1981 11.3392 9.6289 0.4410 5.1996 23.7128 10.4115 0.4112 1.2716 0.8689 3.8033 2.3061 0.5949 0.0184 0.1802 6.8435 3.4073 12.8793 11.7164 8.7603 27.7482 6.3064 10.3916 67.1372 8.4259 34.4714 0.0270 0.0117 1.0880 4.5817 1.5290 1.7838 0.5663 7.9907 6.1629 6.4230 17.9045 2.7138 1.7452 5.9048 22.0481 8.3469 3.7022 5.7341 23.9972 9.1366 1.2361 6.0463 4.1724 16.4329 29.8361 14.8158 18.7616 47.8885 34.1136 43.4044 174.8836 11.1036 2.1946 7.0558 133.5804 2.0040 53.4453 2.2912 55.9201 72.9459 20.0031 18.6474 12.9703 13.3534 15.3959 2.7442 4.9290 0.3044 0.1421 27.8138 2.8681 14.3086 17.5085 30.6517 26.4834 28.2351 18.6121 2.3624 2.0508
temp: 298.150 k
press: 1.00000 atm
elementType: 16 7 6 6 6 6 6 6 6 6 6 6 6 6 6 6 6 6 6 6 6 6 6 6 6 6 6 1 1 1 1 1 1 1 1 1 1 1 1 1 1 1 1 1 1 1 1 1
symmnumber: 1
zpe: 1004085.0 jmol-1
zpe.correction: 0.382436 hartree
zpe.thermalcorrener: 0.405811 hartree
zpe.thermalcorrenthalpy: 0.406755 hartree
zpe.thermalcorrgfe: 0.324719 hartree
zpe.sumelectzpe: -1416.236575 hartree
zpe.sumelectthermal: -1416.213200 hartree
zpe.sumelectthermalent: -1416.212256 hartree
zpe.sumelectthermalfe: -1416.294291 hartree
dipole: -0.3830 5.5430 2.6530
dipole: 6.1572
quadrupole: -140.7512 -169.9187 -159.7034
quadrupole: -6.5087 1.2213 -8.8271
quadrupole: 16.0399 -13.1276 -2.9123 -6.5087 1.2213 -8.8271
hfenergy: -1416.6190105 hartree
pointgroup: C01 [X(C25H21N1S1)]
dipole: -0.1121052 -1.7371137 -1.6846216 debye
polarizability: 389.488366|28.4763178|274.7408393|-2.9529405|41.3518156|267.4475225 unknown
InChI: InChI=1S/C25H21NS/c1-19-12-14-20(15-13-19)18-26-24(22-10-6-3-7-11-22)16-23(17-25(26)27)21-8-4-2-5-9-21/h2-17H,18H2,1H3
charge 0 multiplicity 1
48 atoms
S  0.252373 2.487027 2.989328
N  -0.194973 0.259005 1.380076
C  -1.623863 0.310559 1.842809
C  0.208336 -0.720449 0.464516
C  2.445947 0.294364 0.331571
C  -2.578831 0.854506 0.790057
C  1.493333 -0.704963 -0.067694
C  0.7067 1.26748 1.839099
C  -0.728374 -1.82606 0.082812
C  2.028456 1.236375 1.276752
C  3.821209 0.309518 -0.23756
C  -2.380568 2.142403 0.226392
C  -3.710665 0.106684 0.388541
C  -1.082631 -2.83485 1.017656
C  -1.202995 -1.922672 -1.249549
C  -4.437631 1.917231 -1.116418
C  -3.294318 2.658983 -0.714213
C  -4.628567 0.633253 -0.548515
C  4.072227 -0.187441 -1.54684
C  4.91832 0.820071 0.511121
C  -1.907467 -3.912321 0.628071
C  -2.030417 -2.999832 -1.637747
C  -2.38741 -3.996103 -0.700654
C  -5.428354 2.495027 -2.113195
C  5.373252 -0.168173 -2.091971
C  6.219289 0.837479 -0.032288
C  6.453821 0.344143 -1.337326
H  -1.605851 0.979702 2.72505
H  -1.933449 -0.695459 2.162481
H  1.776504 -1.514797 -0.743297
H  2.694024 2.035543 1.609708
H  -1.5178 2.740404 0.541829
H  -3.872501 -0.896907 0.801552
H  -0.690457 -2.789701 2.040638
H  -0.939776 -1.141641 -1.970987
H  -3.126292 3.657769 -1.136602
H  -5.500095 0.03706 -0.845448
H  3.241282 -0.562406 -2.154867
H  4.757331 1.177628 1.534004
H  -2.166123 -4.688922 1.35619
H  -2.398623 -3.056928 -2.667788
H  -3.028133 -4.832042 -1.002314
H  -5.97493 3.354476 -1.679806
H  -4.919254 2.861396 -3.023914
H  -6.176884 1.744561 -2.420788
H  5.543204 -0.545972 -3.10623
H  7.05137 1.226828 0.564516
H  7.464855 0.356864 -1.758957
