program: Gaussian 09
title: 000186883
version: EM64L-G09RevD.01
frameworkgroup: C1[X(C16H12O4)]
method: RPBEPBE
basis: SDD
operation: Freq
keyword: #pfreq=noraman
keyword: PBEPBE/SDD
title: #p freq=noraman PBEPBE/SDD
converged: YES YES NO NO
title: Mulliken charges:
elementType: O O O O C C C C C C C C C C C C C C C C H H H H H H H H H H H H
charge: -0.264691 -0.268659 -0.185379 -0.203085 0.170385 0.151848 0.223214 0.215873 0.218933 -0.411287 0.160504 -0.412720 0.024127 -0.382329 -0.004069 -0.385577 -0.254995 -0.288422 -0.528731 -0.530538 0.284985 0.287014 0.237625 0.242269 0.258347 0.262028 0.212648 0.230260 0.247208 0.222879 0.247101 0.223233
chargesum: 0.00000
title: Mulliken charges with hydrogens summed into heavy atoms:
elementType: O O O O C C C C C C C C C C C C C C C C
charge: -0.264691 -0.268659 -0.185379 -0.203085 0.170385 0.151848 0.223214 0.215873 0.218933 -0.126302 0.160504 -0.125706 0.024127 -0.144704 -0.004069 -0.143308 0.003352 -0.026394 0.161384 0.162675
polarizability: 2.84825798e+02 8.12312125e+00 2.38970827e+02 5.62944047e+00 9.00913278e+00 8.78916425e+01
1716.lowfreq: -9.0389 -4.6618 -0.0010 -0.0006 0.0000 1.6436 50.4921 54.1058 74.7269
frequency: 50.4706 54.1046 74.7242 82.2541 101.2013 122.7591 162.7830 173.2069 212.7974 223.9032 237.8380 245.3582 250.2545 280.1152 289.5929 313.5678 358.6792 382.5707 396.8769 426.8938 467.1419 474.0416 495.5082 501.6426 563.2008 588.4348 599.6675 607.7514 635.4542 654.1595 664.4348 695.7027 741.7521 772.5642 803.8965 810.2808 827.5447 843.0694 873.9512 883.5130 899.3878 935.0352 988.8578 992.2806 1010.4745 1046.8347 1086.0657 1100.2620 1111.1042 1113.4970 1143.4968 1148.4507 1159.7428 1165.3581 1200.9660 1230.7590 1236.2120 1254.1775 1297.3600 1340.8030 1360.3747 1373.4386 1401.9375 1413.5713 1429.1419 1437.3580 1453.2180 1465.0001 1466.5690 1472.5458 1473.5930 1508.6756 1529.3056 1557.5380 1563.3200 1594.3885 1603.3462 1626.5977 2959.9554 2960.9957 3048.7709 3053.3538 3128.0653 3129.5344 3140.5455 3155.2659 3158.1456 3167.3499 3174.5056 3181.9093
redmass: 3.9109 3.8224 5.3764 3.9816 5.5171 4.5928 3.9454 4.6205 1.3079 2.1815 4.8588 5.8808 1.4943 4.6626 5.4539 3.9499 6.4087 6.0450 5.4471 6.5994 6.5997 4.4133 5.3404 5.8267 4.9464 3.4122 4.5625 5.0001 4.6395 3.6803 5.1554 5.9045 5.3569 4.6464 1.5615 5.2495 6.0810 1.9693 5.4121 1.7145 1.4132 6.9667 6.4373 1.3256 1.3568 3.1858 4.2394 2.1442 1.2949 1.2621 1.5150 1.6860 1.3788 1.4668 1.5048 2.9665 1.9688 3.2590 3.0540 2.2783 3.7619 4.5098 5.0461 3.3875 1.6742 1.2022 1.9151 1.0600 1.0507 1.0665 1.0844 4.9853 10.9428 8.1907 6.6307 6.9390 7.5500 7.4308 1.0332 1.0336 1.1040 1.1025 1.0995 1.0997 1.0865 1.0872 1.0886 1.1008 1.0950 1.0965
irintensity: 0.4563 9.4384 1.5768 1.6004 5.0998 10.8592 2.5069 1.0376 0.3439 0.7372 0.6974 1.6156 1.4528 2.4668 5.1197 5.5652 1.8708 8.3177 3.7228 1.2622 2.5224 6.8378 9.8512 0.9914 2.4489 10.1726 8.9601 0.4898 3.5721 2.6986 0.6625 35.4894 6.0203 2.9281 57.3056 8.0202 7.2356 67.0035 2.4004 11.5346 1.0889 29.9528 48.6627 1.0753 0.7794 6.3457 85.2131 131.6663 5.5038 0.3895 8.5534 27.5215 25.6706 7.5777 2.6016 203.8111 96.5244 63.7218 164.2684 1.9475 1.4192 20.9405 78.9117 42.4592 66.0625 7.5931 157.3097 5.8763 14.8094 13.0008 16.5714 63.2834 118.5463 149.9588 34.4152 43.5685 31.1637 9.8835 62.5478 100.3530 44.8514 38.2907 22.7415 13.9512 0.9025 14.4721 2.1903 13.9732 12.3734 1.4707
temp: 298.150 k
press: 1.00000 atm
elementType: 8 8 8 8 6 6 6 6 6 6 6 6 6 6 6 6 6 6 6 6 1 1 1 1 1 1 1 1 1 1 1 1
symmnumber: 1
zpe: 624409.4 jmol-1
zpe.correction: 0.237825 hartree
zpe.thermalcorrener: 0.254943 hartree
zpe.thermalcorrenthalpy: 0.255888 hartree
zpe.thermalcorrgfe: 0.193215 hartree
zpe.sumelectzpe: -916.360158 hartree
zpe.sumelectthermal: -916.343039 hartree
zpe.sumelectthermalent: -916.342095 hartree
zpe.sumelectthermalfe: -916.404767 hartree
dipole: 5.1033 2.6322 -0.7448
dipole: 5.7903
quadrupole: -90.9744 -110.4429 -120.8340
quadrupole: -7.7695 0.9174 -5.5795
quadrupole: 16.4427 -3.0258 -13.4169 -7.7695 0.9174 -5.5795
hfenergy: -916.5979826 hartree
pointgroup: C01 [X(C16H12O4)]
dipole: 2.047993 0.9973617 0.0254144 debye
polarizability: 282.3946919|3.1289305|233.7107929|24.4973749|28.2136887|95.5827833 unknown
InChI: InChI=1S/C16H12O4/c1-19-13-7-8-14(20-2)16-10(13)4-3-9-11(17)5-6-12(18)15(9)16/h3-8H,1-2H3
charge 0 multiplicity 1
32 atoms
O  0.069313 2.577347 -0.054867
O  3.260939 -2.024754 0.42091
O  -1.917182 1.87381 1.521661
O  -3.589333 -2.642769 -0.851733
C  0.250642 0.189658 0.227106
C  -1.179193 -0.014859 0.155792
C  1.111935 -0.976871 0.196496
C  -1.682276 -1.293526 -0.202788
C  0.88025 1.491108 0.270352
C  0.554025 -2.266916 -0.072023
C  2.529582 -0.826592 0.424432
C  -0.805929 -2.411705 -0.332835
C  -2.181838 0.987191 0.650036
C  2.255201 1.599322 0.516894
C  -3.143586 -1.513848 -0.466345
C  3.079523 0.441918 0.625851
C  -3.598714 0.820105 0.212021
C  -4.059693 -0.360102 -0.295478
C  0.543613 3.919282 0.284194
C  4.707133 -1.9302 0.626418
H  1.228783 -3.126221 -0.093501
H  -1.24403 -3.377979 -0.600563
H  2.726507 2.583468 0.589865
H  4.146748 0.573507 0.823626
H  -4.259938 1.669418 0.4184
H  -5.110379 -0.526746 -0.556664
H  1.411829 4.209941 -0.340128
H  0.807943 3.984675 1.356317
H  -0.304662 4.584943 0.069231
H  5.185292 -1.320951 -0.165171
H  5.074143 -2.965399 0.573283
H  4.942054 -1.501057 1.619911
