program: Gaussian 09
title: 000184809
version: EM64L-G09RevD.01
frameworkgroup: C1[X(C11H22O2)]
method: RPBEPBE
basis: SDD
operation: Freq
keyword: #pfreq=noraman
keyword: PBEPBE/SDD
title: #p freq=noraman PBEPBE/SDD
converged: NO YES NO NO
title: Mulliken charges:
elementType: O O C C C C C C C C C C C H H H H H H H H H H H H H H H H H H H H H H
charge: -0.418964 -0.234642 0.049413 -0.077015 -0.443027 -0.467683 -0.374796 -0.722065 -0.728248 -0.476073 -0.349898 -0.699152 0.181729 0.190850 0.194435 0.194206 0.195958 0.232749 0.210539 0.188243 0.195538 0.221881 0.212255 0.206447 0.224661 0.212007 0.212771 0.235333 0.232020 0.194720 0.192843 0.215448 0.210374 0.210159 0.376983
chargesum: 0.00000
title: Mulliken charges with hydrogens summed into heavy atoms:
elementType: O O C C C C C C C C C C C
charge: -0.041981 -0.234642 0.240263 0.117421 -0.052863 -0.024395 0.008985 -0.081482 -0.078809 -0.008720 0.037665 -0.063171 0.181729
polarizability: 1.31114018e+02 -6.93003089e+00 1.28187400e+02 -2.92895027e+00 -1.75294082e+00 1.13317385e+02
1716.lowfreq: -5.2452 -0.0004 0.0003 0.0005 8.7480 12.3313 15.6883 17.2191 49.3746
frequency: 14.0406 16.2675 49.3012 57.4877 62.7576 66.3455 126.3056 138.8353 161.9277 200.2502 220.8407 225.7951 229.3598 257.6313 289.7612 310.7514 365.0273 399.1046 411.8485 450.9797 466.1604 522.9556 563.6305 603.9745 671.7835 723.3271 739.2590 769.5235 795.0821 848.6112 890.6602 901.0791 909.3362 923.8020 950.5751 963.5317 978.7069 1001.6417 1035.5923 1051.1162 1062.8399 1078.3292 1091.7017 1128.7050 1130.9936 1155.4641 1182.5445 1197.2324 1205.1557 1229.5600 1242.5011 1279.9230 1286.4477 1289.1665 1293.3675 1304.1245 1321.1843 1326.0362 1335.1962 1348.2694 1355.9514 1363.9342 1377.1402 1388.7780 1395.0545 1452.6888 1456.9360 1463.5554 1466.5286 1467.4979 1475.1289 1477.4821 1480.9482 1485.1835 1486.2465 1488.0013 1664.1536 2935.6993 2955.6723 2960.3025 2963.3956 2968.7938 2969.0413 2971.8988 2975.5111 2988.8931 2993.9450 3013.0071 3013.9325 3035.7452 3048.7821 3060.9279 3065.5074 3068.5309 3069.1826 3070.5892 3071.6262 3092.6221 3514.2550
redmass: 9.9206 5.0091 3.2216 1.9515 3.0394 2.1293 2.7980 2.4093 3.5615 1.1330 1.4391 1.3646 1.3059 2.5364 2.2204 2.7726 2.2136 2.6943 2.4575 2.5657 2.8898 3.8955 2.4696 1.3274 2.2009 1.1096 2.7108 1.4742 2.6183 1.9660 1.8317 1.6185 1.1981 1.6490 1.4452 1.9097 2.4304 1.7112 2.8023 2.1249 1.6648 2.3080 1.9214 1.7533 2.3337 2.0558 1.6548 1.5486 1.4115 1.3902 1.2825 1.2235 1.4204 1.3094 1.2473 1.4270 1.2299 1.4289 1.5123 1.4867 1.5359 1.4653 1.2143 1.2159 1.2156 1.0926 1.0766 1.0751 1.0712 1.0487 1.0630 1.0425 1.0618 1.0475 1.0566 1.0839 8.3619 1.0812 1.0597 1.0605 1.0809 1.0423 1.0530 1.0362 1.0374 1.0610 1.0969 1.1005 1.0627 1.1035 1.1005 1.0992 1.0995 1.1006 1.0989 1.0992 1.0988 1.0989 1.0640
irintensity: 0.7812 0.5523 0.2173 0.0871 0.0737 0.0352 0.0295 0.0090 0.1538 0.0711 0.1066 0.0275 0.0036 0.1352 0.3873 0.3376 0.4200 0.6653 2.6039 1.5434 1.7929 33.3597 14.1823 108.9647 47.0917 6.7960 10.5397 1.9186 2.6585 0.3975 13.7468 16.4357 2.0487 33.8707 3.4449 32.0042 1.6218 48.0361 1.3800 3.8641 54.7970 27.5435 15.9476 1.8995 3.4862 23.3875 24.3604 4.2015 3.9045 6.5250 5.3597 1.3121 13.6913 1.7802 8.2000 6.7375 0.0875 2.5412 11.4270 4.8470 1.9254 0.9354 23.7884 13.6841 14.9285 20.6857 2.0044 2.9764 1.5967 0.8250 4.9438 11.5211 4.2816 12.2133 11.6877 22.6217 217.6805 13.2766 0.1621 0.4715 31.0615 42.9318 93.9779 38.7641 25.8101 43.4435 0.8170 0.0937 18.4634 71.1648 21.4697 14.7484 26.4833 87.2469 67.9288 53.6106 76.4822 20.9806 21.2552
temp: 298.150 k
press: 1.00000 atm
elementType: 8 8 6 6 6 6 6 6 6 6 6 6 6 1 1 1 1 1 1 1 1 1 1 1 1 1 1 1 1 1 1 1 1 1 1
symmnumber: 1
zpe: 815893.7 jmol-1
zpe.correction: 0.310758 hartree
zpe.thermalcorrener: 0.327526 hartree
zpe.thermalcorrenthalpy: 0.328471 hartree
zpe.thermalcorrgfe: 0.263461 hartree
zpe.sumelectzpe: -581.745575 hartree
zpe.sumelectthermal: -581.728806 hartree
zpe.sumelectthermalent: -581.727862 hartree
zpe.sumelectthermalfe: -581.792871 hartree
dipole: 1.1244 0.1184 -1.3054
dipole: 1.7269
quadrupole: -88.6398 -79.0528 -84.3010
quadrupole: -1.9569 6.4076 -0.5656
quadrupole: -4.6420 4.9451 -0.3031 -1.9569 6.4076 -0.5656
hfenergy: -582.0563328 hartree
pointgroup: C01 [X(C11H22O2)]
dipole: -0.4342726 0.0390347 -0.5210649 debye
polarizability: 129.278915|-7.3026492|129.6763469|3.0014644|2.2372303|113.6635406 unknown
InChI: InChI=1S/C11H22O2/c1-4-5-6-10(9(2)3)7-8-11(12)13/h9-10,12H,4-8H2,1-3H3
charge 0 multiplicity 1
35 atoms
O  1.553418 2.735968 0.070187
O  2.882039 1.350332 1.372922
C  0.068481 -0.668511 -0.068961
C  0.692681 -2.098086 0.072462
C  -1.474776 -0.691625 -0.269383
C  0.741006 0.160303 -1.200827
C  -2.180905 0.614433 0.164262
C  0.362992 -2.727799 1.448149
C  0.292596 -3.057602 -1.076123
C  2.195864 0.620233 -0.896833
C  -3.695994 0.611864 -0.143961
C  -4.40781 1.904178 0.310885
C  2.276391 1.54911 0.296518
H  0.264684 -0.145268 0.893719
H  1.796038 -1.976773 0.035554
H  -1.705249 -0.893527 -1.336686
H  -1.915924 -1.530823 0.304795
H  0.138107 1.062588 -1.410427
H  0.758601 -0.433683 -2.135762
H  -2.028926 0.765217 1.253672
H  -1.712891 1.48733 -0.335562
H  0.711899 -2.080913 2.27454
H  0.853367 -3.713177 1.557733
H  -0.725196 -2.884276 1.574395
H  -0.791185 -3.275348 -1.056122
H  0.535701 -2.642146 -2.071751
H  0.827313 -4.020634 -0.97789
H  2.590917 1.158871 -1.778724
H  2.857674 -0.237262 -0.69283
H  -3.842976 0.470624 -1.234467
H  -4.166913 -0.264112 0.34784
H  -5.487611 1.877536 0.074776
H  -3.974338 2.791684 -0.187875
H  -4.304302 2.050316 1.402795
H  1.62503 3.316277 0.876078
